{"text_format":"1","workbook":"xlsx","n_sheets":10,"sheets":["Лист1","DIMENSIONAMENTO","РЕД-1","РЕД-2","MODULO1","Modulo5","Modulo4","Modulo6","Modulo2","Modulo3"],"not_rendered":{"charts":0,"images":5,"macros":1,"external_links":0,"defined_names":99,"comments":1,"pivot_tables":0},"unopened":[],"bounds":{"document_bytes":16777216,"sheet_cells":100000,"rows_first":2000,"rows_last":500,"rows_between":2000,"halvings":0,"cell_chars":16384,"cell_head_chars":4096},"cells_cut":0,"cells_raw":0,"read":"whole","date_system":"1900"}

{"sheet":"Лист1","index":0,"n_rows":46,"n_cols":8,"rows_kept":46,"cut":false,"hidden":false,"merged":[[8,0,8,2],[45,0,45,2],[21,1,21,2],[37,0,37,1],[39,0,39,1],[42,0,42,2],[34,0,34,1],[10,2,12,2],[35,0,35,2]]}
["Внимание: для работы программы должны быть включены макросы в настройках Excel"]
[null,null,"ver 2.2 20/04/2020"]
[null,null,null,null,null,"Список моделей фильтров"]
[null,null,null,null,null,"РЕД-25 DN25","G",0.4]
[null,null,null,null,null,"РЕД-40 DN40","G",0.8]
[null,null,null,null,null,"РЕД-50 DN50","G",1.1000000000000001]
[null,null,null,null,null,"РЕД-С-0,5-1-50 DN50","G",0.5]
[null,null,null,null,null,"РЕД-С-1,0-1-65 DN65","G",1]
["Расчет пропускной способности и подбор фильтров газовых РЕД",null,null,null,null,"РЕД-С-1,5-1-80 DN80","G",1.5]
[null,null,null,null,null,"РЕД-С-2,0-1-100 DN100","G",2]
["Название организации","Ваша компания","Внимание!!! Эти ячейки обязательные для заполнения",null,null,"РЕД-С-2,5-1-125 DN125","G",2.5]
["ФИО","Ваши ФИО",null,null,null,"РЕД-С-3,0-1-150 DN150","G",3]
["Контакный телефон","Ваш телефон",null,null,null,"РЕД-С-3,5-1-150 DN150","G",3.5]
[null,null,null,null,null,"РЕД-С-4-1-200 DN200","G",4]
["Параметр","Значение","Примечание",null,null,"РЕД-С-5-1-250 DN250","G",5]
["Максимальное давление на входе в фильтр, МПа",0.6,"значение от 0 до 1,6",null,null,"РЕД-С-6-1-300 DN300","G",6]
["Минимальное давление на входе в фильтр, МПа",0.01,"значение от 0,05* до 1,6, но не более чем максимальное давление на входе",null,null,"РЕД-С-8-1-400 DN400","G",8]
["Допустимый перепад давления на фильтре, кПа",10,"значение от 1 до 50",null,null,"РЕД-С-5-2-300 DN300","G",300]
["Требуемая пропускная способность, нм3/час",3500,"значение от 1 до 347 200",null,null,"РЕД-С-5-2-350 DN350","G",350]
["Выберите типоразмер фильтра из списка","РЕД-25 DN25","выберите из списка**",null,null,"РЕД-С-6-2-400 DN400","G",400]
["Пропускная способность фильтра, нм3/час",{"$f":"IF(B25=0.5,'РЕД-1'!U10,IF(B25=1,'РЕД-1'!U28,IF(B25=1.5,'РЕД-1'!U46,IF(B25=2,'РЕД-1'!U64,IF(B25=2.5,'РЕД-1'!U82,IF(B25=4,'РЕД-1'!U136,IF(B25=3,'РЕД-1'!U100,IF(B25=3.5,'РЕД-1'!U118,B28))))))))","v":150},{"$f":"IFERROR(OR(ISNUMBER(SEARCH(\"#Н/Д\",B21)),B21=\"#Н/Д\")*1,\"Внимание!!! Этот фильтр не может быть использован для введеных данных\")","v":0},null,null,"РЕД-С-8-2-500 DN500","G",500]
["Результат:",{"$f":"IF(B30<1,A32,IF(B30>1.3,A33,IF(B30<=1.3,A31)))","v":"Этот фильтр Вам не подходит, выберите больший типоразмер"}]
[]
[]
["Типоразмер картриджа G",{"$f":"IF(B20=F7,H7,IF(B20=F8,H8,IF(B20=F9,H9,IF(B20=F10,H10,IF(B20=F11,H11,IF(B20=F12,H12,IF(B20=F13,H13,IF(B20=F14,H14,B27))))))))","v":0.4}]
["Типоразмер картриджа G",{"$f":"IF(B20=F4,H4,IF(B20=F5,H5,IF(B20=F6,H6,IF(B20=F15,H15,IF(B20=F16,H16,IF(B20=F17,H17,B25))))))","v":0.4}]
["Типоразмер картриджа G",{"$f":"IF(B20=F18,H18,IF(B20=F19,H19,IF(B20=F20,H20,IF(B20=F21,H21,B26))))","v":0.4}]
["Пропускная способность",{"$f":"IF(B25=5,'РЕД-1'!U154,IF(B25=6,'РЕД-1'!U172,IF(B25=8,'РЕД-1'!U190,IF(B25=300,'РЕД-2'!U227,IF(B25=350,'РЕД-2'!U251,IF(B25=400,'РЕД-2'!U275,IF(B25=500,'РЕД-2'!U299,B29)))))))","v":150}]
["Пропускная способность",{"$f":"IF(B26=0.4,'РЕД-1'!U208,IF(B26=0.8,'РЕД-1'!U226,IF(B26=1.1,'РЕД-1'!U244)))","v":150}]
["Отношение расходов В25",{"$f":"B21/B19","v":4.2857142857142858E-2}]
["Этот фильтр Вам подходит","1≤ B25 ≤ 1,3"]
["Этот фильтр Вам не подходит, выберите больший типоразмер","B25<1"]
["Этот фильтр Вам подходит, однако можно попробовать подобрать меньший типоразмер","B25>1,3"]
[]
["* - только для фильтра РЕД-25 доступно значение от 0,01"]
["** - напротив каждой модели фильтра указан максимально возможный DN для данной модели. Возможно изготовления фильтров с меньшими DN, для получения информации напишите запрос изготовителю"]
[]
["Ввод данных пользователем"]
[null,"Результат"]
["Примечания к вводу данных","Примечания к вводу данных"]
[]
[]
[]
[]
[]
[" "]

{"sheet":"DIMENSIONAMENTO","index":1,"n_rows":208,"n_cols":43,"rows_kept":208,"cut":false,"hidden":true,"merged":[[11,5,11,6],[12,5,12,6],[62,4,62,7],[45,2,47,4]]}
[null,null,null,null,null,null,null,null,null,{"$f":"IF(H16<0.1,6,IF(H16<1,5,IF(H16<10,4,IF(H16>10,3,))))","v":4},"FL",25,550,29,null,"I° APPARECCHIATURA",{"$f":"VLOOKUP(C$16,L1:N8,2,FALSE)","v":550},{"$f":"VLOOKUP(C$16,L1:N8,3,FALSE)","v":29},null,25,15,1,3,null,"FAG",2,6,5,5,null,null,null,null,null,null,null,null,null,null,null,6]
[null,null,null,null,null,null,null,null,null,{"$f":"IF(H17<0.1,6,IF(H17<1,5,IF(H17<10,4,IF(H17>10,3,))))","v":4},null,40,1400,28,null,"II° APPARECCHIATURA",{"$f":"VLOOKUP(C$17,L1:N8,2,FALSE)","v":5200},{"$f":"VLOOKUP(C$17,L1:N8,3,FALSE)","v":29},null,40,20,10,8,null,"FA-12-AP",null,2,null,null,null,"TABELLA PER LA SCELTA DEL TIPO E DEI DIAMETRI DISPONIBILI DEI CONTATORI"]
[null,null,null,null,null,null,null,null,null,{"$f":"IF(H18<0.1,6,IF(H18<1,5,IF(H18<10,4,IF(H18>10,3,))))","v":4},"(AP e BP)",50,2300,27,null,"III° APPARECCHIATURA",{"$f":"VLOOKUP(C$18,L1:N8,2,FALSE)","v":3500},{"$f":"VLOOKUP(C$18,L1:N8,3,FALSE)","v":29},null,50,25,10,7]
[null,null,null,null,null,null,null,null,null,null,null,65,3500,29,null,null,null,null,null,65,32,null,null,null,null,null,null,null,null,null,65,"G/40",50]
[null,null,null,null,null,null,null,null,null,null,null,80,5200,29,null,null,null,null,null,80,40,null,null,null,null,null,null,null,null,null,100,"G/65",50]
[null,null,"Via P.Fabbri n°1 - 40013 - Castelmaggiore (BO) - ITALY - Tel. 051/4190611 Fax 051/4190715",null,null,null,null,null,null,null,null,100,8300,27,null,null,null,null,null,100,50,null,null,null,null,null,null,null,null,null,160,"G/100",80,100]
[null,null,null,null,null,null,null,null,null,null,null,150,17500,28,null,null,null,null,null,150,65,null,null,null,null,{"$f":"D12/(C13+1)","v":1500},null,null,null,null,250,"G/160",80,100,null,null,null,null,null,null,{"$f":"(D12/1.25)/(C13+1)","v":1200},"AO7 è la cella usata per calcolare la "]
["DIMENSIONAMENTO APPARECCHIATURE TARTARINI",null,null,null,null,null,null,null,null,null,null,200,31500,30,null,null,null,null,null,250,80,null,null,null,null,null,null,null,null,null,400,"G/250",80,100,null,null,null,null,null,null,null,"Qmax del contatore con la Qero"]
[null,null,null,null,null,null,null,null,null,null,"FL-SRS",25,470,31,null,"I° APPARECCHIATURA",{"$f":"VLOOKUP(C$16,L9:N15,2,FALSE)","v":470},{"$f":"VLOOKUP(C$16,L9:N15,3,FALSE)","v":31},null,null,100,null,null,null,null,"Z7 è la cella usata per calcolare la Qmax del contatore",null,null,null,null,650,"G/400",100,150]
["VELOCITA' NEL PIPING","P.Monte","P.Valle","Q (Stmc/h)","V (m/s)","DN di CALCOLO",null,"DN REALE","DN ESTERNA","CARRO B.",null,40,1200,30,null,"II° APPARECCHIATURA",{"$f":"VLOOKUP(C$17,L9:N15,2,FALSE)","v":4250},{"$f":"VLOOKUP(C$17,L9:N15,3,FALSE)","v":31},null,null,125,null,null,null,null,null,null,null,null,null,1000,"G/650",150,200]
[null,null,null,null,null,null,null,null,null,null,null,50,1900,29,null,"III° APPARECCHIATURA",{"$f":"VLOOKUP(C$18,L9:N15,2,FALSE)","v":2900},{"$f":"VLOOKUP(C$18,L9:N15,3,FALSE)","v":31},null,25,150,null,null,null,null,null,null,null,null,null,1600,"G/1000",150,200,250]
["MONTE",2,"//",3000,30,{"$f":"SQRT((345.92*D12*(1-0.002*B12)/(E12*(1+B12))))","v":107.16596474627568},{"$f":"SQRT((345.92*E13*(1-0.002*C13)/(F13*(1+C13))))","v":5.4757517080042968},{"$f":"F12*0.95","v":101.80766650896189},{"$f":"IF(AA1=1,AE22,IF(AA1=2,AE23,IF(AA1=3,AE24,IF(AA1=4,AE25,IF(AA1=5,AE26,IF(AA1=6,AE27,IF(AA1=7,AE28,IF(AA1=8,AE29,K13))))))))","v":150},{"$f":"SQRT((345.92*D12*(1-0.002*B12)/(70*(1+B12))))","v":70.156592196111035},null,65,2900,31,null,null,null,null,null,40,200,null,null,null,null,null,null,null,null,null,2500,"G/1600",200,250,300]
["VALLE",null,1,{"$f":"D12","v":3000},25,{"$f":"SQRT((345.92*D12*(1-0.002*C13)/(E13*(1+C13))))","v":143.92251248501742},{"$f":"SQRT((345.92*E14*(1-0.002*C14)/(F14*(1+C14))))","v":{"$error":"#DIV/0!"}},{"$f":"F13*0.95","v":136.72638686076655},{"$f":"IF((I14/1000)<((B12+1)/100),\"DN OK !!\",\"DN ERRATO !!\")","v":"DN OK !!"},{"$f":"SQRT((345.92*D12*(1-0.002*C13)/(70*(1+C13))))","v":86.010152224689648},{"$f":"IF(AA1=9,AE30,IF(AA1=10,AE31,IF(AA1=11,AE32,IF(AA1=12,AE33,IF(AA1=13,AE34)))))","v":false},80,4250,31,null,null,null,null,null,50,250,null,null,null,null,null,null,null,null,null,4000,"G/2500",250,300,400]
[null,null,null,null,null,null,null,null,{"$f":"1000*((B12+1)-SQRT((B12+1)^2-(29.16*30*(D12^1.82)*(1/I12^4.82))))","v":10.094611900863804},null,null,100,6600,29,null,null,null,null,null,65,300,null,null,null,null,null,null,null,null,null,6500,"G/4000",300,400,500]
["APPARECCHIATURE","TIPO","DN","P.Valle (Bar)","Q (Stmc/h)","CG","C1","P.Monte (Bar)","Q di CALCOLO",0.52,null,150,14000,30,null,null,null,null,null,80,400,null,null,null,null,null,null,null,null,null,10000,"G/6500",400,500,600]
["I° APPARECCHIATURA",{"$f":"IF(V1=1,\"FL\",IF(V1=2,\"FL-SRS\",IF(V1=3,\"FL-SR\",IF(V1=4,\"B/249\",IF(V1=5,\"A/149\",IF(V1=6,\"CLX\",IF(V1=7,\"971\",IF(V1=8,\"MBN\",Z46))))))))","v":"FL"},{"$f":"IF(W1=1,15,IF(W1=2,20,IF(W1=3,25,IF(W1=4,32,IF(W1=5,40,IF(W1=6,50,IF(W1=7,65,IF(W1=8,80,Z42))))))))","v":25},{"$f":"C13","v":1},{"$f":"D12","v":3000},{"$f":"IF(V1=1,Q1,IF(V1=2,Q9,IF(V1=3,Q17,IF(V1=4,Q25,IF(V1=5,Q29,IF(V1=6,Q33,IF(V1=7,Q38,IF(V1=8,Q41,Z50))))))))","v":550},{"$f":"IF(V1=1,R1,IF(V1=2,R9,IF(V1=3,R17,IF(V1=4,R25,IF(V1=5,R29,IF(V1=6,R33,IF(V1=7,R38,IF(V1=8,R41,Z54))))))))","v":29},9.49,3000.14,{"$f":"ROUND($H$16,$J$1)","v":9.49},null,null,null,null,null,null,null,null,null,100,null,null,null,null,null,null,null,null,null,null,16000,"G/10000",500,600]
["II° APPARECCHIATURA",{"$f":"IF(V2=1,\"FL\",IF(V2=2,\"FL-SRS\",IF(V2=3,\"FL-SR\",IF(V2=4,\"B/249\",IF(V2=5,\"A/149\",IF(V2=6,\"CLX\",IF(V2=7,\"971\",IF(V2=8,\"MBN\",Z47))))))))","v":"BM5"},{"$f":"IF(W2=1,15,IF(W2=2,20,IF(W2=3,25,IF(W2=4,32,IF(W2=5,40,IF(W2=6,50,IF(W2=7,65,IF(W2=8,80,Z43))))))))","v":80},{"$f":"H16","v":9.49},{"$f":"E16","v":3000},{"$f":"IF(V2=1,Q2,IF(V2=2,Q10,IF(V2=3,Q18,IF(V2=4,Q26,IF(V2=5,Q30,IF(V2=6,Q34,IF(V2=7,Q39,IF(V2=8,Q42,Z51))))))))","v":5408},{"$f":"IF(V2=1,R2,IF(V2=2,R10,IF(V2=3,R18,IF(V2=4,R26,IF(V2=5,R30,IF(V2=6,R34,IF(V2=7,R39,IF(V2=8,R42,Z55))))))))","v":29.7},9.5169400000000017,3000.5547351046648,{"$f":"ROUND($H$17,$J$2)","v":9.5168999999999997},"FL-SR",25,530,29,null,"I° APPARECCHIATURA",{"$f":"VLOOKUP(C$16,L17:N23,2,FALSE)","v":530},{"$f":"VLOOKUP(C$16,L17:N23,3,FALSE)","v":29},null,150,null,null,null,null,null,null,null,null,null,null,25000,"G/16000",600]
["III° APPARECCHIATURA",{"$f":"IF(V3=1,\"FL\",IF(V3=2,\"FL-SRS\",IF(V3=3,\"FL-SR\",IF(V3=4,\"B/249\",IF(V3=5,\"A/149\",IF(V3=6,\"CLX\",IF(V3=7,\"971\",IF(V3=8,\"MBN\",Z48))))))))","v":"BM5"},{"$f":"IF(W3=1,15,IF(W3=2,20,IF(W3=3,25,IF(W3=4,32,IF(W3=5,40,IF(W3=6,50,IF(W3=7,65,IF(W3=8,80,Z44))))))))","v":65},{"$f":"H17","v":9.5169400000000017},{"$f":"E17","v":3000},{"$f":"IF(V3=1,Q3,IF(V3=2,Q11,IF(V3=3,Q19,IF(V3=4,Q27,IF(V3=5,Q31,IF(V3=6,Q35,IF(V3=7,Q40,IF(V3=8,Q43,Z52))))))))","v":3623},{"$f":"IF(V3=1,R3,IF(V3=2,R11,IF(V3=3,R19,IF(V3=4,R27,IF(V3=5,R31,IF(V3=6,R35,IF(V3=7,R40,IF(V3=8,R43,Z56))))))))","v":28},9.5702400000000072,3000.4401722823259,{"$f":"ROUND($H$18,$J$3)","v":9.5701999999999998},null,40,1350,28,null,"II° APPARECCHIATURA",{"$f":"VLOOKUP(C$17,L17:N23,2,FALSE)","v":4950},{"$f":"VLOOKUP(C$17,L17:N23,3,FALSE)","v":29},null,200]
[null,null,null,null,null,null,null,null,null,null,null,50,2200,27,null,"III° APPARECCHIATURA",{"$f":"VLOOKUP(C$18,L17:N23,2,FALSE)","v":3350},{"$f":"VLOOKUP(C$18,L17:N23,3,FALSE)","v":29},null,250]
[null,"TIPO",null,"DN Max IN/OUT","DP (mbar)","P.Monte (Bar)","Portata",null,{"$f":"345.92*($D$12/($C$16^2))*(1-0.002*$B$12)/(1+$B$12)","v":551.25811199999998},"V sede (m/s)",null,65,3350,29,null,null,null,null,null,300,null,null,null,null,null,null,null,null,null,25,"CELLE USATE PER L'ATTRIBUZIONE DEL DN ALLA VALVOLA LIMITATRICE"]
["FILTRO",{"$f":"IF(Z1=1,\"FAG/\",\"FA-12-AP/\")","v":"FA-12-AP/"},150,null,100,6,{"$f":"IF(Z1=1,AA38,AA40)","v":{"$error":"#N/A"}},null,{"$f":"345.92*($D$12/($C$16^2))*(1-0.002*$C$13)/(1+$C$13)","v":828.54758399999992},"V flangia uscita (m/s)",null,80,4950,29,null,null,null,null,null,350,null,null,null,null,null,null,null,null,null,50]
[null,null,null,null,null,null,null,null,null,null,null,100,8000,27,null,null,null,null,null,400,null,null,null,null,null,null,null,null,null,80,25,"CELLE USATE PER L'ATTRIBUZIONE DEL DN ALLA TUBAZIONE  ESTERNA"]
[null,null,null,null,"TIPO","DN",null,null,"VALORI DA INSERIRE",null,null,150,16800,28,null,null,null,null,null,null,null,null,null,null,null,null,null,null,null,100,50]
["VALVOLA DI SICUREZZA",1,null,null,{"$f":"IF(B24=1,AP33,IF(B24=2,AP34,IF(B24=3,AP35)))","v":"CF-31-E"},{"$f":"IF(B24=1,AQ33,IF(B24=2,AQ34,IF(B24=3,AQ35)))","v":"3/4\" X 1\""},null,null,"RISULTATO",null,null,null,null,null,null,null,null,null,null,null,null,null,null,null,null,null,null,null,null,150,80]
[null,null,null,null,null,null,null,null,null,null,"B/249",40,80,22,null,"I° APPARECCHIATURA",{"$f":"IF(B12<0.5,80,IF(B12<3,130,100))","v":130},22,null,null,null,null,null,null,null,null,null,null,null,200,100]
["MISURA (Qimp)",null,"        VOLUMETRICA",null,null,null,"                       VENTURIMETRICA",null,null,null,null,40,130,22,null,"II° APPARECCHIATURA",{"$f":"IF(B12<0.5,80,IF(B12<3,130,100))","v":130},22,null,null,null,null,null,null,null,null,null,null,null,250,125,null,15,"CELLE USATE PER L'ATTRIBUZIONE DEL DN ALLA TUBAZIONE PER LA PERDITA DI CARICO"]
[null,"TIPO","          DIAMETRI DISPONIBILI",null,null,"P. MISURA","Q (Stmc/h)","DP (mmH2O)","DN TRONCO","DN FORO",null,40,100,22,null,"III° APPARECCHIATURA",{"$f":"IF(B12<0.5,80,IF(B12<3,130,100))","v":130},22,null,null,null,null,null,null,null,null,null,null,null,300,150,null,25]
[null,{"$f":"IF(Z7<=AE4,AF4,IF(Z7<=AE5,AF5,IF(Z7<=AE6,AF6,IF(Z7<=AE7,AF7,IF(Z7<=AE8,AF8,IF(Z7<=AE9,AF9,IF(Z7<=AE10,AF10,IF(Z7<=AE11,AF11,B29))))))))","v":"G/1000"},{"$f":"IF(Z7<=AE4,AG4,IF(Z7<=AE5,AG5,IF(Z7<=AE6,AG6,IF(Z7<=AE7,AG7,IF(Z7<=AE8,AG8,IF(Z7<=AE9,AG9,IF(Z7<=AE10,AG10,IF(Z7<=AE11,AG11,C29))))))))","v":150},{"$f":"IF(Z7<=AE4,AH4,IF(Z7<=AE5,AH5,IF(Z7<=AE6,AH6,IF(Z7<=AE7,AH7,IF(Z7<=AE8,AH8,IF(Z7<=AE9,AH9,IF(Z7<=AE10,AH10,IF(Z7<=AE11,AH11,D29))))))))","v":200},{"$f":"IF(Z7<=AE4,AI4,IF(Z7<=AE5,AI5,IF(Z7<=AE6,AI6,IF(Z7<=AE7,AI7,IF(Z7<=AE8,AI8,IF(Z7<=AE9,AI9,IF(Z7<=AE10,AI10,IF(Z7<=AE11,AI11,E29))))))))","v":250},{"$f":"C13","v":1},{"$f":"D12","v":3000},5000,{"$f":"SQRT((112*G28)/(SQRT((H28/100)*((F28+1)*100))))/0.6","v":96.609178307929596},{"$f":"SQRT((G28*0.704)/(0.01252*1*0.6*SQRT(0.70145*(((F28*10000)+10265)/10333)*(1/0.9922))*SQRT(H28)))","v":58.109514549554696},null,null,null,null,null,null,null,null,null,null,null,null,null,null,null,null,null,null,null,null,200,null,32]
[null,{"$f":"IF(Z7<=AE12,AF12,IF(Z7<=AE13,AF13,IF(Z7<=AE14,AF14,IF(Z7<=AE15,AF15,IF(Z7<=AE16,AF16,IF(Z7<=AE17,AF17))))))","v":"G/1600"},{"$f":"IF(Z7<=AE12,AG12,IF(Z7<=AE13,AG13,IF(Z7<=AE14,AG14,IF(Z7<=AE15,AG15,IF(Z7<=AE16,AG16,IF(Z7<=AE17,AG17,\"\"))))))","v":200},{"$f":"IF(Z7<=AE12,AH12,IF(Z7<=AE13,AH13,IF(Z7<=AE14,AH14,IF(Z7<=AE15,AH15,IF(Z7<=AE16,AH16,IF(Z7<=AE17,AH17,\"\"))))))","v":250},{"$f":"IF(Z7<=AE12,AI12,IF(Z7<=AE13,AI13,IF(Z7<=AE14,AI14,IF(Z7<=AE15,AI15,IF(Z7<=AE16,AI16,IF(Z7<=AE17,AI17,\"\"))))))","v":300},null,null,null,null,null,"A/149",50,390,28,null,"I° APPARECCHIATURA",{"$f":"IF(B12<3,390,300)","v":390},28,null,null,null,null,null,null,null,null,null,null,null,null,250,null,40]
[null,null,"VALV. SICUREZZA - REMI",null,null,null,null,"PERDITA DI CARICO NELLA TUBAZIONE",null,null,null,50,300,28,null,"II° APPARECCHIATURA",{"$f":"IF(B12<3,390,300)","v":390},28,null,null,null,null,null,null,null,null,null,null,null,null,300,null,50,null,15,"CELLE USATE PER L'ATTRIBUZIONE DEL DN  PER IL CALCOLO DELL'AREA DELLA VALVOLA DI SICUREZZA"]
[null,null,{"$f":"IF(AC1=9,AI38,IF(AC1=10,AI39,IF(AC1=11,AI40,IF(AC1=12,AI41,IF(AC1=13,AI42,IF(AC1=14,AI43,IF(AC1=15,AI44,IF(AC1=16,AI45))))))))","v":false},null,null,null,null,null,null,null,null,null,null,null,null,"III° APPARECCHIATURA",{"$f":"IF(B12<3,390,300)","v":390},28,null,null,null,null,null,null,null,null,null,null,null,null,350,null,65,null,25]
[null,"Diametro",{"$f":"IF(AC1=1,AI30,IF(AC1=2,AI31,IF(AC1=3,AI32,IF(AC1=4,AI33,IF(AC1=5,AI34,IF(AC1=6,AI35,IF(AC1=7,AI36,IF(AC1=8,AI37,C31))))))))","v":50},"mm",null,null,"Diametro",{"$f":"IF(AB1=1,AG26,IF(AB1=2,AG27,IF(AB1=3,AG28,IF(AB1=4,AG29,IF(AB1=5,AG30,IF(AB1=6,AG31,IF(AB1=7,AG32,IF(AB1=8,AG33,J32))))))))","v":50},"mm",{"$f":"IF(AB1=9,AG34,IF(AB1=10,AG35,IF(AB1=11,AG36,IF(AB1=12,AG37,IF(AB1=13,AG38,IF(AB1=14,AG39,IF(AB1=15,AG40,IF(AG41=16,AG41))))))))","v":false},null,null,null,null,null,null,null,null,null,null,null,null,null,null,null,null,null,null,null,null,400,null,80,null,32,null,null,null,null,"CELLE USATE PER IL CALCOLO DELLA VALVOLA DI SICUREZZA"]
[null,"K (coeff.)",0.93100000000000005,null,null,null,"P.M.",6,"bar",null,"CLX",25,600,30,null,"I° APPARECCHIATURA",{"$f":"VLOOKUP(C$16,L33:N36,2,FALSE)","v":600},{"$f":"VLOOKUP(C$16,L33:N36,3,FALSE)","v":30},null,null,null,null,null,null,null,null,null,null,null,null,450,null,100,null,40,null,null,"SENZA MISURA",null,null,null,{"$f":"IF(F12<=100,AL37,IF(F12<=125,AL38,IF(F12<=150,AL39,IF(F12<=200,AL40,IF(F12<=250,AL41,\"NO CF\")))))","v":"CF-31-E"},{"$f":"IF(F12<=100,AM37,IF(F12<=125,AM38,IF(F12<=150,AM39,IF(F12<=200,AM40,IF(F12<=250,AM41,\"NO CF\")))))","v":"3/4\" X 1\""}]
[null,null,null,null,null,null,"Portata",560,"Stmc/h",null,null,50,"1850",30,null,"II° APPARECCHIATURA",{"$f":"VLOOKUP(C$17,L33:N36,2,FALSE)","v":3900},{"$f":"VLOOKUP(C$17,L33:N36,3,FALSE)","v":30},null,{"$f":"IF(C21=0.5,50,IF(C21=1,65,IF(C21=1.5,80,IF(C21=2,100,IF(C21=2.5,125,IF(C21=3,150,IF(C21=3.5,150,T35)))))))","v":false},"CELLA USATA PER L'ATTRIBUZIONE DEL DN DEI FAG",null,null,null,null,null,null,null,null,null,500,null,125,null,50,null,null,"MISURA VOLUMETRICA",null,null,null,{"$f":"IF(C28<=100,AL37,IF(C28=150,AL39,IF(C28=200,AL40,IF(C28=250,AL41,\"NO CF\"))))","v":"CF-31-F"},{"$f":"IF(C28<=100,AM37,IF(C28<=125,AM38,IF(C28<=150,AM39,IF(C28<=200,AM40,IF(C28<=250,AM41,\"NO CF\")))))","v":"1\" X 1\" ½"}]
[null,"Area",{"$f":"(PI()*(C32/10)^2)/(4*C33)","v":21.090176245903553},"mmq",null,null,"Lunghezza",20,"metri",null,null,80,3900,30,null,"III° APPARECCHIATURA",{"$f":"VLOOKUP(C$18,L33:N36,2,FALSE)","v":{"$error":"#N/A"}},{"$f":"VLOOKUP(C$18,L33:N36,3,FALSE)","v":{"$error":"#N/A"}},null,{"$f":"IF(C21=4,200,IF(C21=5,250,IF(C21=6,300)))","v":false},"CELLA USATA PER L'ATTRIBUZIONE DEL DN DEI FAG",null,null,null,null,null,null,null,null,null,null,null,150,null,65,null,null,"MISURA VENTURIMETRICA",null,null,null,{"$f":"IF(I28<=100,AL37,IF(I28<=150,AL39,IF(I28<=200,AL40,IF(I28<=250,AL41,\"NO CF\"))))","v":"CF-31-D"},{"$f":"IF(I28<=100,AM37,IF(I28<=150,AM39,IF(I28<=200,AM40,IF(I28<=250,AM41,\"NO CF\"))))","v":"½\" X 1\""}]
[null,null,null,null,null,null,null,null,null,null,null,100,6500,30,null,null,null,null,null,{"$f":"IF(C21=50,50,IF(C21=65,65,IF(C21=80,80,IF(C21=100,100,IF(C21=\"100-S\",100,IF(C21=150,150,IF(C21=200,200,T37)))))))","v":150},"CELLA USATA PER L'ATTRIBUZIONE DEL DN DEGLI FA-12-AP",null,null,null,null,null,null,null,null,null,null,null,200,null,80]
[null,null," CALCOLO DEL CG",null,null,null,"DP",{"$f":"1000*((H33+1)-SQRT((H33+1)^2-(29.16*H35*(H34^1.82)*(1/H32^4.82))))","v":27.114287500620726},"mbar",null,null,null,null,null,null,null,null,null,null,{"$f":"IF(C21=250,250,IF(C21=300,300,IF(C21=350,350,IF(C21=400,400))))","v":false},"CELLA USATA PER L'ATTRIBUZIONE DEL DN DEGLI FA-12-AP",null,null,null,null,null,null,null,null,null,null,null,250,null,100,null,null,"CF-31-D","½\" X 1\""]
[null,null,null,null,null,null,null,null,null,null,971,250,32500,31,null,"I° APPARECCHIATURA",{"$f":"VLOOKUP(C$16,L38:N38,2,FALSE)","v":{"$error":"#N/A"}},{"$f":"VLOOKUP(C$16,L38:N38,3,FALSE)","v":{"$error":"#N/A"}},null,null,null,null,null,null,null,null,{"$f":"IF(C21=0.5,'РЕД-1'!U10,IF(C21=1,'РЕД-1'!U28,IF(C21=1.5,'РЕД-1'!U46,IF(C21=2,'РЕД-1'!U64,IF(C21=2.5,'РЕД-1'!U82,IF(C21=3,'РЕД-1'!U100,IF(C21=3.5,'РЕД-1'!U118,IF(C21=4,'РЕД-1'!U136,AA39))))))))","v":false},"CELLA USATA PER IL CALCOLO",null,null,null,null,300,null,125,null,null,"CF-31-E","3/4\" X 1\""]
[null,"Portata",6250,"Stmc/h",null,null,null," CALCOLO DELLA PORTATA",null,null,null,null,null,null,null,"II° APPARECCHIATURA",{"$f":"VLOOKUP(C$17,L38:N38,2,FALSE)","v":{"$error":"#N/A"}},{"$f":"VLOOKUP(C$17,L38:N38,3,FALSE)","v":{"$error":"#N/A"}},null,null,null,null,null,null,null,null,{"$f":"IF(C21=5,'РЕД-1'!U154,IF(C21=6,'РЕД-1'!U172))","v":false},"DELLA PORTATA DEI FAG CON TABELLA",null,null,null,null,350,null,150,null,null,"CF-31-F","1\" X 1\" ½"]
[null,"P. M.",35,"bar",null,null,null,null,null,null,null,null,null,null,null,"III° APPARECCHIATURA",{"$f":"VLOOKUP(C$18,L38:N38,2,FALSE)","v":{"$error":"#N/A"}},{"$f":"VLOOKUP(C$18,L38:N38,3,FALSE)","v":{"$error":"#N/A"}},null,null,null,null,"FL",null,null,null,{"$f":"IF(C21=50,'РЕД-2'!U35,IF(C21=65,'РЕД-2'!U59,IF(C21=80,'РЕД-2'!U83,IF(C21=100,'РЕД-2'!U107,IF(C21=\"100-S\",'РЕД-2'!U131,IF(C21=150,'РЕД-2'!U155,IF(C21=200,'РЕД-2'!U179,IF(C21=250,'РЕД-2'!U203,AA41))))))))","v":{"$error":"#N/A"}},"CELLA USATA PER IL CALCOLO",null,null,null,null,400,null,200,null,null,"CF-31-G","1\"1/4 X 1\" ½"]
[null,"P. V.",30,"bar",null,null,"CG",1850,null,null," MN/MBN",25,390,28,null,"I° APPARECCHIATURA",{"$f":"VLOOKUP(C$16,L41:N46,2,FALSE)","v":390},{"$f":"VLOOKUP(C$16,L41:N46,3,FALSE)","v":28},null,null,null,null,"FL/SRS",null,null,null,{"$f":"IF(C21=300,'РЕД-2'!U227,IF(C21=350,'РЕД-2'!U251,IF(C21=400,'РЕД-2'!U275)))","v":false},"DELLA PORTATA DEI FA/12-AP CON TABELLA",null,null,null,null,500,null,250,null,null,"CF-31-H","1\" ½ X 2\" ½"]
[null,"C1",29,null,null,null,"C1","28",null,null,null,40,655,25,null,"II° APPARECCHIATURA",{"$f":"VLOOKUP(C$17,L41:N46,2,FALSE)","v":2200},{"$f":"VLOOKUP(C$17,L41:N46,3,FALSE)","v":25},null,null,null,null,"FL/SR",null,null,{"$f":"IF(W1=9,100,IF(W1=10,125,IF(W1=11,150,IF(W1=12,200,IF(W1=13,250,IF(W1=14,300,IF(W1=15,400)))))))","v":false},"Celle usate per il DN nel calcolo della pressione di ",null,null,null,null,null,null,null,300]
[null,null,null,null,null,null,"P. M.",14,"bar",null,null,50,800,25,null,"III° APPARECCHIATURA",{"$f":"VLOOKUP(C$18,L41:N46,2,FALSE)","v":1500},{"$f":"VLOOKUP(C$18,L41:N46,3,FALSE)","v":25},null,null,null,null,"B/249",null,null,{"$f":"IF(W2=9,100,IF(W2=10,125,IF(W2=11,150,IF(W2=12,200,IF(W2=13,250,IF(W2=14,300,IF(W2=15,400)))))))","v":false},"monte minima nel calcolo delle 3 apparecchiature",null,null,null,null,null,null,null,350]
[null,"CG",{"$f":"IF((C41+1)<=((C40+1)/2),T57,IF((C41+1)>((C40+1)/2),T58))","v":481.38956164622437},"necessario",null,null,"P. V.",13,"bar",null,null,65,1500,25,null,null,null,null,null,null,null,null,"A/149",null,null,{"$f":"IF(W3=9,100,IF(W3=10,125,IF(W3=11,150,IF(W3=12,200,IF(W3=13,250,IF(W3=14,300,IF(W3=15,400)))))))","v":false},null,null,null,null,null,null,null,null,400]
[null,null,null,null,null,null,null,null,null,null,null,80,2200,25,null,null,null,null,null,null,null,null,"CLX",null,null,null,null,null,null,null,null,null,null,null,500]
[null,null,null,null,null,null,"Tipo gas",null,null,null,null,100,2700,25,null,null,null,null,null,null,null,null,971,null,null,{"$f":"IF(V1=9,\"MBN+\",IF(V1=10,\"BM5\",IF(V1=11,\"BM6X\",IF(V1=12,\"BM7\",IF(V1=13,\"RP/10\",IF(V1=14,\"RP/011\",IF(V1=15,\"RP/022\",IF(V1=16,\"RP/033\",Z58))))))))","v":false},"Celle usate per il tipo apparecchiatura "]
["CALCOLO DELLA RUMOROSITA'",null,null,null,null,null,null,null,null,null,null,150,null,null,null,null,null,null,null,null,null,null,"MBN",null,null,{"$f":"IF(V2=9,\"MBN+\",IF(V2=10,\"BM5\",IF(V2=11,\"BM6X\",IF(V2=12,\"BM7\",IF(V2=13,\"RP/10\",IF(V2=14,\"RP/011\",IF(V2=15,\"RP/022\",IF(V2=16,\"RP/033\",Z59))))))))","v":"BM5"},"nel calcolo pres. monte minima delle 3 app.",null,null,null,"METANO"]
[null,null,null,null,null,null,"Portata",{"$f":"IF(AE53=1,J48,IF(AE53=2,J48*0.63,IF(AE53=3,J48*0.55,IF(AE53=4,J48*0.79,IF(AE53=5,J48*0.78)))))","v":7541.6911796062232},"Stmc/h",{"$f":"IF((H44+1)<=((H43+1)/2),T60,IF((H44)+1>((H43+1)/2),T61))","v":7541.6911796062232},null,null,null,null,null,null,null,null,null,null,null,null,"MBN+",null,null,{"$f":"IF(V3=9,\"MBN+\",IF(V3=10,\"BM5\",IF(V3=11,\"BM6X\",IF(V3=12,\"BM7\",IF(V3=13,\"RP/10\",IF(V3=14,\"RP/011\",IF(V3=15,\"RP/022\",IF(V3=16,\"RP/033\",Z60))))))))","v":"BM5"},null,null,null,null,"PROPANO"]
[null,null,null,null,null,null,null,null,null,null,"MN/MBN+",25,450,28,null,"I° APPARECCHIATURA",{"$f":"VLOOKUP(C$16,L49:N54,2,FALSE)","v":450},{"$f":"VLOOKUP(C$16,L49:N54,3,FALSE)","v":28},null,null,null,null,"BM5",null,null,null,null,null,null,null,"BUTANO","Celle usate per las celta del tipo di gas "]
[null,null," AREA VALVOLA DI SICUREZZA",null,null,null,null,"PORTATA VALVOLA DI SICUREZZA",null,null,null,40,900,25,null,"II° APPARECCHIATURA",{"$f":"VLOOKUP(C$17,L49:N54,2,FALSE)","v":2700},{"$f":"VLOOKUP(C$17,L49:N54,3,FALSE)","v":25},null,null,null,null,"BM6X",null,null,{"$f":"IF(V1=9,Q49,IF(V1=10,Q57,IF(V1=11,Q65,IF(V1=12,Q74,IF(V1=13,Q82,IF(V1=14,Q86,IF(V1=15,Q90,IF(V1=16,Q94,Z74))))))))","v":false},"Celle usate per il CG della pressione di ",null,null,null,"AZOTO","per il calcolo della portata"]
[null,"P. T.",6.6,"bar",null,null,"P. T.",6.6,"bar",null,null,50,1100,25,null,"III° APPARECCHIATURA",{"$f":"VLOOKUP(C$18,L49:N54,2,FALSE)","v":1800},{"$f":"VLOOKUP(C$18,L49:N54,3,FALSE)","v":25},null,null,null,null,"BM7",null,null,{"$f":"IF(V2=9,Q50,IF(V2=10,Q58,IF(V2=11,Q66,IF(V2=12,Q75,IF(V2=13,Q83,IF(V2=14,Q87,IF(V2=15,Q91,IF(V2=16,Q95,Z75))))))))","v":5408},"monte minima nel calcolo delle 3 apparec.",null,null,null,"ARIA"]
[null,"Portata",523,"stmc/h",null,null,"Area efflusso",0.86499999999999999,"cmq",null,null,65,1800,25,null,null,null,null,null,null,null,null,"RP/10",null,null,{"$f":"IF(V3=9,Q51,IF(V3=10,Q59,IF(V3=11,Q67,IF(V3=12,Q76,IF(V3=13,Q84,IF(V3=14,Q88,IF(V3=15,Q92,IF(V3=16,Q96,Z76))))))))","v":3623}]
[null,"K (coeff.)",0.93100000000000005,null,null,null,"K (coeff.)",0.93100000000000005,null,null,null,80,2700,25,null,null,null,null,null,null,null,null,"RP/011",null,null,null,null,null,null,null,1]
[null,null,null,null,null,null,null,null,null,null,null,100,4000,25,null,null,null,null,null,null,null,null,"RP/022",null,null,{"$f":"IF(V1=9,R49,IF(V1=10,R57,IF(V1=11,R65,IF(V1=12,R74,IF(V1=13,R82,IF(V1=14,R86,IF(V1=15,R90,IF(V1=16,R94,Z90))))))))","v":false},"Celle usate per il C1 della pressione di "]
[null,"Area",{"$f":"(C52*0.702)/(0.9*C53*260*(C51*1.1+1))*SQRT((1*(273+15)/16.04))","v":0.86454435053280043},"cmq",null,null,"Portata",{"$f":"(H52*0.9*H53*260*(H51*1.1+1))/(0.702*SQRT(1*(273+15)/16.04))","v":523.27564192767954},"stmc/h",null,null,150,null,null,null,null,null,null,null,null,null,null,"RP/033",null,null,{"$f":"IF(V2=9,R50,IF(V2=10,R58,IF(V2=11,R66,IF(V2=12,R75,IF(V2=13,R83,IF(V2=14,R87,IF(V2=15,R91,IF(V2=16,R95,Z91))))))))","v":29.7},"monte minima nel calcolo delle 3 apparec."]
[null,null,null,null,null,null,null,null,null,null,null,null,null,null,null,null,null,null,null,null,null,null,"C",null,null,{"$f":"IF(V3=9,R51,IF(V3=10,R59,IF(V3=11,R67,IF(V3=12,R76,IF(V3=13,R84,IF(V3=14,R88,IF(V3=15,R92,IF(V3=16,R96,Z92))))))))","v":28}]
["CALCOLO DEL CIRCUITO TERMICO",null,null,null,"CALCOLO DEL VASO DI ESPANSIONE",null,null,null,null,null,"BM5",25,525,29.2,null,"I° APPARECCHIATURA",{"$f":"VLOOKUP(C$16,L57:N64,2,FALSE)","v":525},{"$f":"VLOOKUP(C$16,L57:N64,3,FALSE)","v":29.2},null,{"$f":"C39/((C40+1)*0.52)","v":333.86752136752136},"CALCOLO DEL CG",null,"CB"]
[null,null,null,null,null,null,null,null,null,null,null,40,1418,28.1,null,"II° APPARECCHIATURA",{"$f":"VLOOKUP(C$17,L57:N64,2,FALSE)","v":5408},{"$f":"VLOOKUP(C$17,L57:N64,3,FALSE)","v":29.7},null,{"$f":"C39/(0.52*(C40+1)*(SIN(RADIANS((3417/C42)*SQRT(((C40+1)-(C41+1))/(C40+1))))))","v":481.38956164622437},"CALCOLO DEL CG",null,"CC",null,null,{"$f":"IF(V1=17,\"C\",IF(V1=18,\"CB\",IF(V1=19,\"CC\",IF(V1=20,\"CCB\",IF(V1=21,\"C/SR\",IF(V1=22,\"CB/SR\",IF(V1=23,\"CC/SR\",IF(V1=24,\"CCB/SR\",Z62))))))))","v":false},"Celle usate per il tipo apparecchiatura "]
["Calcolo del salto entalpico",null,null,null,"Pot. termica",140000,"Kcal/h",null,null,null,null,50,2258,26.4,null,"III° APPARECCHIATURA",{"$f":"VLOOKUP(C$18,L57:N64,2,FALSE)","v":3623},{"$f":"VLOOKUP(C$18,L57:N64,3,FALSE)","v":28},null,null,null,null,"CCB",null,null,{"$f":"IF(V2=17,\"C\",IF(V2=18,\"CB\",IF(V2=19,\"CC\",IF(V2=20,\"CCB\",IF(V2=21,\"C/SR\",IF(V2=22,\"CB/SR\",IF(V2=23,\"CC/SR\",IF(V2=24,\"CCB/SR\",Z63))))))))","v":false},"nel calcolo pres. monte minima delle 3 app."]
[null,null,null,null,null,null,null,null,null,null,null,65,3623,28,null,null,null,null,null,{"$f":"0.52*H41*(H43+1)","v":14430},"CALCOLO PORTATA",null,"C/SR",null,null,{"$f":"IF(V3=17,\"C\",IF(V3=18,\"CB\",IF(V3=19,\"CC\",IF(V3=20,\"CCB\",IF(V3=21,\"C/SR\",IF(V3=22,\"CB/SR\",IF(V3=23,\"CC/SR\",IF(V3=24,\"CCB/SR\",Z64))))))))","v":false}]
["Pressione di preriscaldo",75,"Bar",null,"Capacità",{"$f":"F59/1500","v":93.333333333333329},"litri",null,null,null,null,80,5408,29.7,null,null,null,null,null,{"$f":"0.52*H41*(H43+1)*SIN(RADIANS((3417/H42)*SQRT(((H43+1)-(H44+1))/(H43+1))))","v":7541.6911796062232},"CALCOLO PORTATA",null,"CB/SR"]
["Pressione di uscita",4,"Bar",null,null,null,null,null,null,null,null,100,8715,26.5,null,null,null,null,null,null,null,null,"CC/SR",null,null,{"$f":"IF(V1=25,\"C/SRS\",IF(V1=26,\"CB/SRS\",IF(V1=27,\"CC/SRS\",IF(V1=28,\"CCB/SRS\",IF(V1=29,\"C all.\",IF(V1=30,\"CB all.\",IF(V1=31,\"CC all.\",IF(V1=32,\"CCB all.\",Z66))))))))","v":false},"Celle usate per il tipo apparecchiatura "]
["Temperatura di ingresso",5,"°C",null,"CALCOLO IMPIANTO ODORIZZANTE",null,null,null,null,null,null,150,18600,28,null,null,null,null,null,null,null,null,"CCB/SR",null,null,{"$f":"IF(V2=25,\"C/SRS\",IF(V2=26,\"CB/SRS\",IF(V2=27,\"CC/SRS\",IF(V2=28,\"CCB/SRS\",IF(V2=29,\"C all.\",IF(V2=30,\"CB all.\",IF(V2=31,\"CC all.\",IF(V2=32,\"CCB all.\",Z67))))))))","v":false},"nel calcolo pres. monte minima delle 3 app."]
["Temperatura di uscita",10,"°C",null,null,null,null,null,null,null,null,null,null,null,null,null,null,null,null,null,null,null,"C/SRS",null,null,{"$f":"IF(V3=25,\"C/SRS\",IF(V3=26,\"CB/SRS\",IF(V3=27,\"CC/SRS\",IF(V3=28,\"CCB/SRS\",IF(V3=29,\"C all.\",IF(V3=30,\"CB all.\",IF(V3=31,\"CC all.\",IF(V3=32,\"CCB all.\",Z68))))))))","v":false}]
[null,null,null,null,"Portata (Qero)",{"$f":"D12/1.25","v":2400},"Stm3/h",null,null,null,"BM6",150,20250,18,null,"I° APPARECCHIATURA",{"$f":"VLOOKUP(C$16,L65:N70,2,FALSE)","v":{"$error":"#N/A"}},{"$f":"VLOOKUP(C$16,L65:N70,3,FALSE)","v":{"$error":"#N/A"}},null,null,null,null,"CB/SRS"]
["h",{"$f":"(0.874*(B61-B62)+0.00123*(B61^2-B62^2)-0.00005*(B61^3-B62^3)+0.0000004*(B61^4-B62^4)-1.554*(B63-B64)-0.00381*((B61*B63)-(B62*B64))-0.0000376*((B61^2*B63)-(B62^2*B64)))/3","v":21.986944533333332},"Kcal/Kg",null,null,null,null,null,null,null,null,200,36000,18,null,"II° APPARECCHIATURA",{"$f":"VLOOKUP(C$17,L65:N70,2,FALSE)","v":{"$error":"#N/A"}},{"$f":"VLOOKUP(C$17,L65:N70,3,FALSE)","v":{"$error":"#N/A"}},null,null,null,null,"CC/SRS",null,null,{"$f":"IF(V1=33,\"CBS\",IF(V1=34,\"CCS\",IF(V1=35,\"CCBS\",IF(V1=36,\"CBS/SR\",IF(V1=37,\"CCS/SR\",IF(V1=38,\"CCBS/SR\",IF(V1=39,\"CBS/SRS\",IF(V1=40,\"CCS/SRS\",Z70))))))))","v":false},"Celle usate per il tipo apparecchiatura "]
[null,null,null,null,"Capacità",{"$f":"F65/100","v":24},"litri",null,null,null,null,250,55800,18,null,"III° APPARECCHIATURA",{"$f":"VLOOKUP(C$18,L65:N70,2,FALSE)","v":{"$error":"#N/A"}},{"$f":"VLOOKUP(C$18,L65:N70,3,FALSE)","v":{"$error":"#N/A"}},null,null,null,null,"CCB/SRS",null,null,{"$f":"IF(V2=33,\"CBS\",IF(V2=34,\"CCS\",IF(V2=35,\"CCBS\",IF(V2=36,\"CBS/SR\",IF(V2=37,\"CCS/SR\",IF(V2=38,\"CCBS/SR\",IF(V2=39,\"CBS/SRS\",IF(V2=40,\"CCS/SRS\",Z71))))))))","v":false},"nel calcolo pres. monte minima delle 3 app."]
["Calcolo potenzialità scambiatore",null,null,null,null,null,null,null,null,null,null,300,81000,18,null,null,null,null,null,null,null,null,"C all.",null,null,{"$f":"IF(V3=33,\"CBS\",IF(V3=34,\"CCS\",IF(V3=35,\"CCBS\",IF(V3=36,\"CBS/SR\",IF(V3=37,\"CCS/SR\",IF(V3=38,\"CCBS/SR\",IF(V3=39,\"CBS/SRS\",IF(V3=40,\"CCS/SRS\",Z72))))))))","v":false}]
[null,null,null,null,null,"Valori da inserire",null,null,null,null,null,400,144000,18,null,null,null,null,null,null,null,null,"CB all."]
["Q Gas",8000,"Stmc/h",null,null,null,null,null,null,null,null,null,null,null,null,null,null,null,null,null,null,null,"CC all.",null,null,{"$f":"IF(V1=41,\"CCBS/SRS\",IF(V1=42,\"CBS all.\",IF(V1=43,\"CCS all.\",IF(V1=44,\"CCBS all.\"))))","v":false},"Celle usate per il tipo apparecchiatura "]
[null,null,null,null,null,"Valori ottenuti",null,null,null,null,null,null,null,null,null,null,null,null,null,null,null,null,"CCB all.",null,null,{"$f":"IF(V2=41,\"CCBS/SRS\",IF(V2=42,\"CBS all.\",IF(V2=43,\"CCS all.\",IF(V2=44,\"CCBS all.\"))))","v":false},"nel calcolo pres. monte minima delle 3 app."]
["C",{"$f":"0.78*B66*B70","v":137198.53388799998},"Kcal/h",null,null,null,null,null,null,null,null,null,null,null,null,null,null,null,null,null,null,null,"CBS",null,null,{"$f":"IF(V3=41,\"CCBS/SRS\",IF(V3=42,\"CBS all.\",IF(V3=43,\"CCS all.\",IF(V3=44,\"CCBS all.\"))))","v":false}]
[null,null,null,null,null,null,null,null,null,null,null,null,null,null,null,null,null,null,null,null,null,null,"CCS"]
["Calcolo potenzialità caldaia",null,null,null,"CALCOLO DEL MODULO POMPE",null,null,null,null,12,"BM7","1\" ½\"",170,29,null,"I° APPARECCHIATURA",{"$f":"VLOOKUP(C$16,L74:N78,2,FALSE)","v":{"$error":"#N/A"}},{"$f":"VLOOKUP(C$16,L74:N78,3,FALSE)","v":{"$error":"#N/A"}},null,null,null,null,"CCBS",null,null,{"$f":"IF(V1=17,Q98,IF(V1=18,Q102,IF(V1=19,Q106,IF(V1=20,Q110,IF(V1=21,Q114,IF(V1=22,Q118,IF(V1=23,Q122,IF(V1=24,Q126,Z78))))))))","v":false},"Celle usate per il CG della pressione di "]
[null,null,null,null,null,null,null,null,null,null,null,"2\"",500,29,null,"II° APPARECCHIATURA",{"$f":"VLOOKUP(C$17,L74:N78,2,FALSE)","v":{"$error":"#N/A"}},{"$f":"VLOOKUP(C$17,L74:N78,3,FALSE)","v":{"$error":"#N/A"}},null,null,null,null,"CBS/SR",null,null,{"$f":"IF(V2=17,Q99,IF(V2=18,Q103,IF(V2=19,Q107,IF(V2=20,Q111,IF(V2=21,Q115,IF(V2=22,Q119,IF(V2=23,Q123,IF(V2=24,Q127,Z79))))))))","v":false},"monte minima nel calcolo delle 3 apparec."]
["Q Gas",{"$f":"B70","v":8000},"Stmc/h",null,"Pot.caldaia",{"$f":"B78","v":151270.17838933333},"Kcal/h",null,null,null,null,"2\"F",650,29,null,"III° APPARECCHIATURA",{"$f":"VLOOKUP(C$18,L74:N78,2,FALSE)","v":{"$error":"#N/A"}},{"$f":"VLOOKUP(C$18,L74:N78,3,FALSE)","v":{"$error":"#N/A"}},null,null,null,null,"CCS/SR",null,null,{"$f":"IF(V3=17,Q100,IF(V3=18,Q104,IF(V3=19,Q108,IF(V3=20,Q112,IF(V3=21,Q116,IF(V3=22,Q120,IF(V3=23,Q124,IF(V3=24,Q128,Z80))))))))","v":false}]
[null,null,null,null,null,null,null,null,null,null,null,40,170,29,null,null,null,null,null,null,null,null,"CCBS/SR"]
["B",{"$f":"0.86*B66*B76","v":151270.17838933333},"Kcal/h",null,"Necessari",{"$f":"F76/10000","v":15.127017838933334},"metri cubi",null,null,null,null,50,650,29,null,null,null,null,null,null,null,null,"CBS/SRS",null,null,{"$f":"IF(V1=25,Q130,IF(V1=26,Q134,IF(V1=27,Q138,IF(V1=28,Q142,IF(V1=29,Q146,IF(V1=30,Q150,IF(V1=31,Q154,IF(V1=32,Q158,Z82))))))))","v":false},"Celle usate per il CG della pressione di "]
[null,null,null,null,null,null,null,null,null,null,null,null,null,null,null,null,null,null,null,null,null,null,"CCS/SRS",null,null,{"$f":"IF(V2=25,Q131,IF(V2=26,Q135,IF(V2=27,Q139,IF(V2=28,Q143,IF(V2=29,Q147,IF(V2=30,Q151,IF(V2=31,Q155,IF(V2=32,Q159,Z83))))))))","v":false},"monte minima nel calcolo delle 3 apparec."]
["Calcolo DN valvola a saracinesca",null,null,null,"CALCOLO  VALVOLA LIMITATRICE",null,null,null,null,null,null,null,null,null,null,null,null,null,null,null,null,null,"CCBS/SRS",null,null,{"$f":"IF(V3=25,Q132,IF(V3=26,Q136,IF(V3=27,Q140,IF(V3=28,Q144,IF(V3=29,Q148,IF(V3=30,Q152,IF(V3=31,Q156,IF(V3=32,Q160,Z84))))))))","v":false}]
[null,null,null,null,null,null,null,null,null,null,null,null,null,null,null,null,null,null,null,null,null,null,"CBS all."]
["Velocità",0.75,"m/s",null,"P. M.",5,"bar",null,null,13,"RP/10",20,70,31,null,"I° APPARECCHIATURA",{"$f":"VLOOKUP(C$16,L82:N82,2,FALSE)","v":{"$error":"#N/A"}},{"$f":"VLOOKUP(C$16,L82:N82,3,FALSE)","v":{"$error":"#N/A"}},null,null,null,null,"CCS all.",null,null,{"$f":"IF(V1=33,Q162,IF(V1=34,Q166,IF(V1=35,Q170,IF(V1=36,Q174,IF(V1=37,Q178,IF(V1=38,Q182,IF(V1=39,Q186,IF(V1=40,Q190,Z86))))))))","v":false},"Celle usate per il CG della pressione di "]
["Q Gas",{"$f":"B98","v":13719.853388799998},"Lt/h",null,"P. V.",4.8,"bar",null,null,null,null,null,null,null,null,"II° APPARECCHIATURA",{"$f":"VLOOKUP(C$17,L82:N82,2,FALSE)","v":{"$error":"#N/A"}},{"$f":"VLOOKUP(C$17,L82:N82,3,FALSE)","v":{"$error":"#N/A"}},null,null,null,null,"CCBS all.",null,null,{"$f":"IF(V2=33,Q163,IF(V2=34,Q167,IF(V2=35,Q171,IF(V2=36,Q175,IF(V2=37,Q179,IF(V2=38,Q183,IF(V2=39,Q187,IF(V2=40,Q191,Z87))))))))","v":false},"monte minima nel calcolo delle 3 apparec."]
[null,null,null,null,"DN",{"$f":"IF(AO1=1,25,IF(AO1=2,50,IF(AO1=3,80,IF(AO1=4,100,IF(AO1=5,150,IF(AO1=6,200,IF(AO1=7,250,IF(AO1=8,300))))))))","v":200},null,null,null,null,null,null,null,null,null,"III° APPARECCHIATURA",{"$f":"VLOOKUP(C$18,L82:N82,2,FALSE)","v":{"$error":"#N/A"}},{"$f":"VLOOKUP(C$18,L82:N82,3,FALSE)","v":{"$error":"#N/A"}},null,null,null,null,null,null,null,{"$f":"IF(V3=33,Q164,IF(V3=34,Q168,IF(V3=35,Q172,IF(V3=36,Q176,IF(V3=37,Q180,IF(V3=38,Q184,IF(V3=39,Q188,IF(V3=40,Q192,Z88))))))))","v":false}]
["DN di calcolo valvola saracinesca",{"$f":"SQRT((1/B82)*(B83/3.6)*(1/0.95))","v":73.135974163752607},"mm",null,"CG",{"$f":"IF(AO1=1,600,IF(AO1=2,2500,IF(AO1=3,4998,IF(AO1=4,8010,IF(AO1=5,16700,IF(AO1=6,19215,IF(AO1=7,32500,IF(AO1=8,37795))))))))","v":19215}]
["DN VALVOLA A SARACINESCA",{"$f":"IF(B85<40,40,IF(B85<50,50,IF(B85<65,65,IF(B85<80,80,IF(B85<100,100,IF(B85<125,125,IF(B85<150,150,IF(B85<200,200,B87))))))))","v":80},"mm",null,"C1",31,null,null,null,14,"RP/011",25,97,25,null,"I° APPARECCHIATURA",{"$f":"VLOOKUP(C$16,L86:N86,2,FALSE)","v":97},{"$f":"VLOOKUP(C$16,L86:N86,3,FALSE)","v":25},null,null,null,null,null,null,null,{"$f":"IF(V1=41,Q194,IF(V1=42,Q198,IF(V1=43,Q202,IF(V1=44,Q206))))","v":false},"Celle usate per il CG della pressione di "]
[null,{"$f":"IF(B85<250,250)","v":250},null,null,null,null,null,null,null,null,null,null,null,null,null,"II° APPARECCHIATURA",{"$f":"VLOOKUP(C$17,L86:N86,2,FALSE)","v":{"$error":"#N/A"}},{"$f":"VLOOKUP(C$17,L86:N86,3,FALSE)","v":{"$error":"#N/A"}},null,null,null,null,null,null,null,{"$f":"IF(V2=41,Q195,IF(V2=42,Q199,IF(V2=43,Q203,IF(V2=44,Q207))))","v":false},"monte minima nel calcolo delle 3 apparec."]
["Calcolo velocità circuito termico",null,null,null,"Portata",{"$f":"IF(((F82+1)/2)>=(F83+1),(0.52*F85*(F82+1)),TRUNC((0.52*F85*(F82+1))*SIN(0.01745329252*(3417/F86)*SQRT(((F82+1)-(F83+1))/(F82+1)))+0.5))","v":20627},"Stmc/h",null,null,null,null,null,null,null,null,"III° APPARECCHIATURA",{"$f":"VLOOKUP(C$18,L86:N86,2,FALSE)","v":{"$error":"#N/A"}},{"$f":"VLOOKUP(C$18,L86:N86,3,FALSE)","v":{"$error":"#N/A"}},null,null,null,null,null,null,null,{"$f":"IF(V3=41,Q196,IF(V3=42,Q200,IF(V3=43,Q204,IF(V3=44,Q208))))","v":false}]
[]
["ACQUA",null,null,null,null,null,null,null,null,15,"RP/022",32,235,27,null,"I° APPARECCHIATURA",{"$f":"VLOOKUP(C$16,L90:N90,2,FALSE)","v":{"$error":"#N/A"}},{"$f":"VLOOKUP(C$16,L90:N90,3,FALSE)","v":{"$error":"#N/A"}},null,null,null,null,null,null,null,{"$f":"IF(V1=17,R98,IF(V1=18,R102,IF(V1=19,R106,IF(V1=20,R110,IF(V1=21,R114,IF(V1=22,R118,IF(V1=23,R122,IF(V1=24,R126,Z94))))))))","v":false},"Celle usate per il C1 della pressione di "]
["Temperatura ingresso",80,"°C",null,null,null,null,null,null,null,null,null,null,null,null,"II° APPARECCHIATURA",{"$f":"VLOOKUP(C$17,L90:N90,2,FALSE)","v":{"$error":"#N/A"}},{"$f":"VLOOKUP(C$17,L90:N95,3,FALSE)","v":{"$error":"#N/A"}},null,null,null,null,null,null,null,{"$f":"IF(V2=17,R99,IF(V2=18,R103,IF(V2=19,R107,IF(V2=20,R111,IF(V2=21,R115,IF(V2=22,R119,IF(V2=23,R123,IF(V2=24,R127,Z95))))))))","v":false},"monte minima nel calcolo delle 3 apparec."]
["Temperatura uscita",70,"°C",null,null,null,null,null,null,null,null,null,null,null,null,"III° APPARECCHIATURA",{"$f":"VLOOKUP(C$18,L90:N90,2,FALSE)","v":{"$error":"#N/A"}},{"$f":"VLOOKUP(C$18,L90:N90,3,FALSE)","v":{"$error":"#N/A"}},null,null,null,null,null,null,null,{"$f":"IF(V3=17,R100,IF(V3=18,R104,IF(V3=19,R108,IF(V3=20,R112,IF(V3=21,R116,IF(V3=22,R120,IF(V3=23,R124,IF(V3=24,R128,Z96))))))))","v":false}]
["Delta T",{"$f":"(B91-B92)","v":10},null,null,"CALCOLO DELLA VALVOLA TERMOREGOLATRICE"]
[null,null,null,null,null,null,null,null,null,16,"RP/033",50,360,27,null,"I° APPARECCHIATURA",{"$f":"VLOOKUP(C$16,L94:N94,2,FALSE)","v":{"$error":"#N/A"}},{"$f":"VLOOKUP(C$16,L94:N94,3,FALSE)","v":{"$error":"#N/A"}},null,null,null,null,null,null,null,{"$f":"IF(V1=25,R130,IF(V1=26,R134,IF(V1=27,R138,IF(V1=28,R142,IF(V1=29,R146,IF(V1=30,R150,IF(V1=31,R154,IF(V1=32,R158,Z98))))))))","v":false},"Celle usate per il C1 della pressione di "]
["Potenzialità scambiatore",{"$f":"B72","v":137198.53388799998},null,null,"Q ",{"$f":"B98","v":13719.853388799998},"Lt/h",null,null,null,null,null,null,null,null,"II° APPARECCHIATURA",{"$f":"VLOOKUP(C$17,L94:N94,2,FALSE)","v":{"$error":"#N/A"}},{"$f":"VLOOKUP(C$17,L94:N94,3,FALSE)","v":{"$error":"#N/A"}},null,null,null,null,null,null,null,{"$f":"IF(V2=25,R131,IF(V2=26,R135,IF(V2=27,R139,IF(V2=28,R143,IF(V2=29,R147,IF(V2=30,R151,IF(V2=31,R155,IF(V2=32,R159,Z99))))))))","v":false},"monte minima nel calcolo delle 3 apparec."]
["DN Circuito",80,"mm",null,"Qminuto",{"$f":"F95/60","v":228.66422314666664},"Lt/minuto",null,null,null,null,null,null,null,null,"III° APPARECCHIATURA",{"$f":"VLOOKUP(C$18,L94:N94,2,FALSE)","v":{"$error":"#N/A"}},{"$f":"VLOOKUP(C$18,L94:N94,3,FALSE)","v":{"$error":"#N/A"}},null,null,null,null,null,null,null,{"$f":"IF(V3=25,R132,IF(V3=26,R136,IF(V3=27,R140,IF(V3=28,R144,IF(V3=29,R148,IF(V3=30,R152,IF(V3=31,R156,IF(V3=32,R160,Z100))))))))","v":false}]
[null,null,null,null,"d",1,"Kg/dmc"]
["Q ",{"$f":"B95/B93","v":13719.853388799998},"Lt/h",null,"Delta P",0.13,"Bar",null,null,17,"C",25,550,30,null,"I° APPARECCHIATURA",{"$f":"VLOOKUP(C$16,L98:N100,2,FALSE)","v":550},{"$f":"VLOOKUP(C$16,L98:N100,3,FALSE)","v":30},null,null,null,null,null,null,null,{"$f":"IF(V1=33,R162,IF(V1=34,R166,IF(V1=35,R170,IF(V1=36,R174,IF(V1=37,R178,IF(V1=38,R182,IF(V1=39,R186,IF(V1=40,R190,Z102))))))))","v":false},"Celle usate per il C1 della pressione di "]
[null,null,null,null,null,null,null,null,null,null,null,50,2250,29,null,"II° APPARECCHIATURA",{"$f":"VLOOKUP(C$17,L98:N100,2,FALSE)","v":5100},{"$f":"VLOOKUP(C$17,L98:N100,3,FALSE)","v":29},null,null,null,null,null,null,null,{"$f":"IF(V2=33,R163,IF(V2=34,R167,IF(V2=35,R171,IF(V2=36,R175,IF(V2=37,R179,IF(V2=38,R183,IF(V2=39,R187,IF(V2=40,R191,Z103))))))))","v":false},"monte minima nel calcolo delle 3 apparec."]
["Velocità circolo",{"$f":"(1/B96^2)*(B98/3.6)*(1/0.95)","v":0.62682078713450273},"m/s",null,"Kv",{"$f":"F96*0.058*SQRT((F97/F98))","v":36.783625940252215},null,null,null,null,null,80,5100,29,null,"III° APPARECCHIATURA",{"$f":"VLOOKUP(C$18,L98:N100,2,FALSE)","v":{"$error":"#N/A"}},{"$f":"VLOOKUP(C$18,L98:N100,3,FALSE)","v":{"$error":"#N/A"}},null,null,null,null,null,null,null,{"$f":"IF(V3=33,R164,IF(V3=34,R168,IF(V3=35,R172,IF(V3=36,R176,IF(V3=37,R180,IF(V3=38,R184,IF(V3=39,R188,IF(V3=40,R192,Z104))))))))","v":false}]
["Velocità VS",{"$f":"(1/B86^2)*(B98/3.6)*(1/0.95)","v":0.62682078713450273},"m/s",null,"TIPO / DN",{"$f":"IF(F100<2.8,\"KA/15\",IF(F100<4.5,\"KA/20\",IF(F100<9.5,\"KA/25\",IF(F100<16,\"KA/32\",IF(F100<23,\"KA/40\",IF(F100<33,\"KA/50\",IF(F100<50,\"M2F/65\",F102)))))))","v":"M2F/65"}]
[null,null,null,null,null,{"$f":"IF(F100<80,\"M2F/80\",IF(F100<125,\"M2F/100\",IF(F100<215,\"M2F/125\",IF(F100<310,\"M2F/150\"))))","v":"M2F/80"},null,null,null,18,"CB",25,510,30.5,null,"I° APPARECCHIATURA",{"$f":"VLOOKUP(C$16,L102:N104,2,FALSE)","v":510},{"$f":"VLOOKUP(C$16,L102:N104,3,FALSE)","v":30.5},null,null,null,null,null,null,null,{"$f":"IF(V1=41,R194,IF(V1=42,R198,IF(V1=43,R202,IF(V1=44,R206))))","v":false},"Celle usate per il C1 della pressione di "]
[null,null,null,null,null,null,null,null,null,null,null,50,2080,30,null,"II° APPARECCHIATURA",{"$f":"VLOOKUP(C$17,L102:N104,2,FALSE)","v":4800},{"$f":"VLOOKUP(C$17,L102:N104,3,FALSE)","v":30},null,null,null,null,null,null,null,{"$f":"IF(V2=41,R195,IF(V2=42,R199,IF(V2=43,R203,IF(V2=44,R207))))","v":false},"monte minima nel calcolo delle 3 apparec."]
[null,null,null,null,null,null,null,null,null,null,null,80,4800,30,null,"III° APPARECCHIATURA",{"$f":"VLOOKUP(C$18,L102:N104,2,FALSE)","v":{"$error":"#N/A"}},{"$f":"VLOOKUP(C$18,L102:N104,3,FALSE)","v":{"$error":"#N/A"}},null,null,null,null,null,null,null,{"$f":"IF(V3=41,R196,IF(V3=42,R200,IF(V3=43,R204,IF(V3=44,R208))))","v":false}]
[]
[null,null,null,null,null,null,null,null,null,19,"CC",25,510,30.5,null,"I° APPARECCHIATURA",{"$f":"VLOOKUP(C$16,L106:N108,2,FALSE)","v":510},{"$f":"VLOOKUP(C$16,L106:N108,3,FALSE)","v":30.5}]
[null,null,null,null,null,null,null,null,null,null,null,50,2080,30,null,"II° APPARECCHIATURA",{"$f":"VLOOKUP(C$17,L106:N108,2,FALSE)","v":4800},{"$f":"VLOOKUP(C$17,L106:N108,3,FALSE)","v":30}]
[null,null,null,null,null,null,null,null,null,null,null,80,4800,30,null,"III° APPARECCHIATURA",{"$f":"VLOOKUP(C$18,L106:N108,2,FALSE)","v":{"$error":"#N/A"}},{"$f":"VLOOKUP(C$18,L106:N108,3,FALSE)","v":{"$error":"#N/A"}}]
[]
[null,null,null,null,null,null,null,null,null,20,"CCB",25,500,31,null,"I° APPARECCHIATURA",{"$f":"VLOOKUP(C$16,L110:N112,2,FALSE)","v":500},{"$f":"VLOOKUP(C$16,L110:N112,3,FALSE)","v":31}]
[null,null,null,null,null,null,null,null,null,null,null,50,2050,30.5,null,"II° APPARECCHIATURA",{"$f":"VLOOKUP(C$17,L110:N112,2,FALSE)","v":4700},{"$f":"VLOOKUP(C$17,L110:N112,3,FALSE)","v":31}]
[null,null,null,null,null,null,null,null,null,null,null,80,4700,31,null,"III° APPARECCHIATURA",{"$f":"VLOOKUP(C$18,L110:N112,2,FALSE)","v":{"$error":"#N/A"}},{"$f":"VLOOKUP(C$18,L110:N112,3,FALSE)","v":{"$error":"#N/A"}}]
[]
[null,null,null,null,null,null,null,null,null,21,"C/SR",25,540,30,null,"I° APPARECCHIATURA",{"$f":"VLOOKUP(C$16,L114:N116,2,FALSE)","v":540},{"$f":"VLOOKUP(C$16,L114:N116,3,FALSE)","v":30}]
[null,null,null,null,null,null,null,null,null,null,null,50,2200,29,null,"II° APPARECCHIATURA",{"$f":"VLOOKUP(C$17,L114:N116,2,FALSE)","v":5000},{"$f":"VLOOKUP(C$17,L114:N116,3,FALSE)","v":29}]
[null,null,null,null,null,null,null,null,null,null,null,80,5000,29,null,"III° APPARECCHIATURA",{"$f":"VLOOKUP(C$18,L114:N116,2,FALSE)","v":{"$error":"#N/A"}},{"$f":"VLOOKUP(C$18,L114:N116,3,FALSE)","v":{"$error":"#N/A"}}]
[]
[null,null,null,null,null,null,null,null,null,22,"CB/SR",25,500,30.5,null,"I° APPARECCHIATURA",{"$f":"VLOOKUP(C$16,L118:N120,2,FALSE)","v":500},{"$f":"VLOOKUP(C$16,L118:N120,3,FALSE)","v":30.5}]
[null,null,null,null,null,null,null,null,null,null,null,50,2030,30,null,"II° APPARECCHIATURA",{"$f":"VLOOKUP(C$17,L118:N120,2,FALSE)","v":4700},{"$f":"VLOOKUP(C$17,L118:N120,3,FALSE)","v":30}]
[null,null,null,null,null,null,null,null,null,null,null,80,4700,30,null,"III° APPARECCHIATURA",{"$f":"VLOOKUP(C$18,L118:N120,2,FALSE)","v":{"$error":"#N/A"}},{"$f":"VLOOKUP(C$18,L118:N120,3,FALSE)","v":{"$error":"#N/A"}}]
[]
[null,null,null,null,null,null,null,null,null,23,"CC/SR",25,500,30.5,null,"I° APPARECCHIATURA",{"$f":"VLOOKUP(C$16,L122:N124,2,FALSE)","v":500},{"$f":"VLOOKUP(C$16,L122:N124,3,FALSE)","v":30.5}]
[null,null,null,null,null,null,null,null,null,null,null,50,2030,30,null,"II° APPARECCHIATURA",{"$f":"VLOOKUP(C$17,L122:N124,2,FALSE)","v":4700},{"$f":"VLOOKUP(C$17,L122:N124,3,FALSE)","v":30}]
[null,null,null,null,null,null,null,null,null,null,null,80,4700,30,null,"III° APPARECCHIATURA",{"$f":"VLOOKUP(C$18,L122:N124,2,FALSE)","v":{"$error":"#N/A"}},{"$f":"VLOOKUP(C$18,L122:N124,3,FALSE)","v":{"$error":"#N/A"}}]
[]
[null,null,null,null,null,null,null,null,null,24,"CCB/SR",25,490,31,null,"I° APPARECCHIATURA",{"$f":"VLOOKUP(C$16,L126:N128,2,FALSE)","v":490},{"$f":"VLOOKUP(C$16,L126:N128,3,FALSE)","v":31}]
[null,null,null,null,null,null,null,null,null,null,null,50,2000,31,null,"II° APPARECCHIATURA",{"$f":"VLOOKUP(C$17,L126:N128,2,FALSE)","v":4600},{"$f":"VLOOKUP(C$17,L126:N128,3,FALSE)","v":31}]
[null,null,null,null,null,null,null,null,null,null,null,80,4600,31,null,"III° APPARECCHIATURA",{"$f":"VLOOKUP(C$18,L126:N128,2,FALSE)","v":{"$error":"#N/A"}},{"$f":"VLOOKUP(C$18,L126:N128,3,FALSE)","v":{"$error":"#N/A"}}]
[]
[null,null,null,null,null,null,null,null,null,25,"C/SRS",25,500,33,null,"I° APPARECCHIATURA",{"$f":"VLOOKUP(C$16,L130:N132,2,FALSE)","v":500},{"$f":"VLOOKUP(C$16,L130:N132,3,FALSE)","v":33}]
[null,null,null,null,null,null,null,null,null,null,null,50,1900,32,null,"II° APPARECCHIATURA",{"$f":"VLOOKUP(C$17,L130:N132,2,FALSE)","v":4200},{"$f":"VLOOKUP(C$17,L130:N132,3,FALSE)","v":32}]
[null,null,null,null,null,null,null,null,null,null,null,80,4200,32,null,"III° APPARECCHIATURA",{"$f":"VLOOKUP(C$18,L130:N132,2,FALSE)","v":{"$error":"#N/A"}},{"$f":"VLOOKUP(C$18,L130:N132,3,FALSE)","v":{"$error":"#N/A"}}]
[]
[null,null,null,null,null,null,null,null,null,26,"CB/SRS",25,460,33.5,null,"I° APPARECCHIATURA",{"$f":"VLOOKUP(C$16,L134:N136,2,FALSE)","v":460},{"$f":"VLOOKUP(C$16,L134:N136,3,FALSE)","v":33.5}]
[null,null,null,null,null,null,null,null,null,null,null,50,1780,33,null,"II° APPARECCHIATURA",{"$f":"VLOOKUP(C$17,L134:N136,2,FALSE)","v":4000},{"$f":"VLOOKUP(C$17,L134:N136,3,FALSE)","v":33}]
[null,null,null,null,null,null,null,null,null,null,null,80,4000,33,null,"III° APPARECCHIATURA",{"$f":"VLOOKUP(C$18,L134:N136,2,FALSE)","v":{"$error":"#N/A"}},{"$f":"VLOOKUP(C$18,L134:N136,3,FALSE)","v":{"$error":"#N/A"}}]
[]
[null,null,null,null,null,null,null,null,null,27,"CC/SRS",25,460,33.5,null,"I° APPARECCHIATURA",{"$f":"VLOOKUP(C$16,L138:N140,2,FALSE)","v":460},{"$f":"VLOOKUP(C$16,L138:N140,3,FALSE)","v":33.5}]
[null,null,null,null,null,null,null,null,null,null,null,50,1780,33,null,"II° APPARECCHIATURA",{"$f":"VLOOKUP(C$17,L138:N140,2,FALSE)","v":4000},{"$f":"VLOOKUP(C$17,L138:N140,3,FALSE)","v":33}]
[null,null,null,null,null,null,null,null,null,null,null,80,4000,33,null,"III° APPARECCHIATURA",{"$f":"VLOOKUP(C$18,L138:N140,2,FALSE)","v":{"$error":"#N/A"}},{"$f":"VLOOKUP(C$18,L138:N140,3,FALSE)","v":{"$error":"#N/A"}}]
[]
[null,null,null,null,null,null,null,null,null,28,"CCB/SRS",25,450,34,null,"I° APPARECCHIATURA",{"$f":"VLOOKUP(C$16,L142:N144,2,FALSE)","v":450},{"$f":"VLOOKUP(C$16,L142:N144,3,FALSE)","v":34}]
[null,null,null,null,null,null,null,null,null,null,null,50,1750,33.5,null,"II° APPARECCHIATURA",{"$f":"VLOOKUP(C$17,L142:N144,2,FALSE)","v":3900},{"$f":"VLOOKUP(C$17,L142:N144,3,FALSE)","v":34}]
[null,null,null,null,null,null,null,null,null,null,null,80,3900,34,null,"III° APPARECCHIATURA",{"$f":"VLOOKUP(C$18,L142:N144,2,FALSE)","v":{"$error":"#N/A"}},{"$f":"VLOOKUP(C$18,L142:N144,3,FALSE)","v":{"$error":"#N/A"}}]
[]
[null,null,null,null,null,null,null,null,null,29,"C all.",25,580,30,null,"I° APPARECCHIATURA",{"$f":"VLOOKUP(C$16,L146:N148,2,FALSE)","v":580},{"$f":"VLOOKUP(C$16,L146:N148,3,FALSE)","v":30}]
[null,null,null,null,null,null,null,null,null,null,null,50,2300,29,null,"II° APPARECCHIATURA",{"$f":"VLOOKUP(C$17,L146:N148,2,FALSE)","v":5200},{"$f":"VLOOKUP(C$17,L146:N148,3,FALSE)","v":29}]
[null,null,null,null,null,null,null,null,null,null,null,80,5200,29,null,"III° APPARECCHIATURA",{"$f":"VLOOKUP(C$18,L146:N148,2,FALSE)","v":{"$error":"#N/A"}},{"$f":"VLOOKUP(C$18,L146:N148,3,FALSE)","v":{"$error":"#N/A"}}]
[]
[null,null,null,null,null,null,null,null,null,30,"CB all.",25,550,31,null,"I° APPARECCHIATURA",{"$f":"VLOOKUP(C$16,L150:N152,2,FALSE)","v":550},{"$f":"VLOOKUP(C$16,L150:N152,3,FALSE)","v":31}]
[null,null,null,null,null,null,null,null,null,null,null,50,2100,30,null,"II° APPARECCHIATURA",{"$f":"VLOOKUP(C$17,L150:N152,2,FALSE)","v":4850},{"$f":"VLOOKUP(C$17,L150:N152,3,FALSE)","v":30}]
[null,null,null,null,null,null,null,null,null,null,null,80,4850,30,null,"III° APPARECCHIATURA",{"$f":"VLOOKUP(C$18,L150:N152,2,FALSE)","v":{"$error":"#N/A"}},{"$f":"VLOOKUP(C$18,L150:N152,3,FALSE)","v":{"$error":"#N/A"}}]
[]
[null,null,null,null,null,null,null,null,null,31,"CC all.",25,550,31,null,"I° APPARECCHIATURA",{"$f":"VLOOKUP(C$16,L154:N156,2,FALSE)","v":550},{"$f":"VLOOKUP(C$16,L154:N156,3,FALSE)","v":31}]
[null,null,null,null,null,null,null,null,null,null,null,50,2100,30.5,null,"II° APPARECCHIATURA",{"$f":"VLOOKUP(C$17,L154:N156,2,FALSE)","v":4850},{"$f":"VLOOKUP(C$17,L154:N156,3,FALSE)","v":31}]
[null,null,null,null,null,null,null,null,null,null,null,80,4850,31,null,"III° APPARECCHIATURA",{"$f":"VLOOKUP(C$18,L154:N156,2,FALSE)","v":{"$error":"#N/A"}},{"$f":"VLOOKUP(C$18,L154:N156,3,FALSE)","v":{"$error":"#N/A"}}]
[]
[null,null,null,null,null,null,null,null,null,32,"CCB all.",25,540,31,null,"I° APPARECCHIATURA",{"$f":"VLOOKUP(C$16,L158:N160,2,FALSE)","v":540},{"$f":"VLOOKUP(C$16,L158:N160,3,FALSE)","v":31}]
[null,null,null,null,null,null,null,null,null,null,null,50,2050,30.5,null,"II° APPARECCHIATURA",{"$f":"VLOOKUP(C$17,L158:N160,2,FALSE)","v":4800},{"$f":"VLOOKUP(C$17,L158:N160,3,FALSE)","v":31}]
[null,null,null,null,null,null,null,null,null,null,null,80,4800,31,null,"III° APPARECCHIATURA",{"$f":"VLOOKUP(C$18,L158:N160,2,FALSE)","v":{"$error":"#N/A"}},{"$f":"VLOOKUP(C$18,L158:N160,3,FALSE)","v":{"$error":"#N/A"}}]
[]
[null,null,null,null,null,null,null,null,null,33,"CBS",25,450,30,null,"I° APPARECCHIATURA",{"$f":"VLOOKUP(C$16,L162:N164,2,FALSE)","v":450},{"$f":"VLOOKUP(C$16,L162:N164,3,FALSE)","v":30}]
[null,null,null,null,null,null,null,null,null,null,null,50,1850,30,null,"II° APPARECCHIATURA",{"$f":"VLOOKUP(C$17,L162:N164,2,FALSE)","v":4300},{"$f":"VLOOKUP(C$17,L162:N164,3,FALSE)","v":30}]
[null,null,null,null,null,null,null,null,null,null,null,80,4300,30,null,"III° APPARECCHIATURA",{"$f":"VLOOKUP(C$18,L162:N164,2,FALSE)","v":{"$error":"#N/A"}},{"$f":"VLOOKUP(C$18,L162:N164,3,FALSE)","v":{"$error":"#N/A"}}]
[]
[null,null,null,null,null,null,null,null,null,34,"CCS",25,450,30,null,"I° APPARECCHIATURA",{"$f":"VLOOKUP(C$16,L166:N168,2,FALSE)","v":450},{"$f":"VLOOKUP(C$16,L166:N168,3,FALSE)","v":30}]
[null,null,null,null,null,null,null,null,null,null,null,50,1850,30,null,"II° APPARECCHIATURA",{"$f":"VLOOKUP(C$17,L166:N168,2,FALSE)","v":4300},{"$f":"VLOOKUP(C$17,L166:N168,3,FALSE)","v":30}]
[null,null,null,null,null,null,null,null,null,null,null,80,4300,30,null,"III° APPARECCHIATURA",{"$f":"VLOOKUP(C$18,L166:N168,2,FALSE)","v":{"$error":"#N/A"}},{"$f":"VLOOKUP(C$18,L166:N168,3,FALSE)","v":{"$error":"#N/A"}}]
[]
[null,null,null,null,null,null,null,null,null,35,"CCBS",25,440,31,null,"I° APPARECCHIATURA",{"$f":"VLOOKUP(C$16,L170:N172,2,FALSE)","v":440},{"$f":"VLOOKUP(C$16,L170:N172,3,FALSE)","v":31}]
[null,null,null,null,null,null,null,null,null,null,null,50,1800,31,null,"II° APPARECCHIATURA",{"$f":"VLOOKUP(C$17,L170:N172,2,FALSE)","v":4200},{"$f":"VLOOKUP(C$17,L170:N172,3,FALSE)","v":31}]
[null,null,null,null,null,null,null,null,null,null,null,80,4200,31,null,"III° APPARECCHIATURA",{"$f":"VLOOKUP(C$18,L170:N172,2,FALSE)","v":{"$error":"#N/A"}},{"$f":"VLOOKUP(C$18,L170:N172,3,FALSE)","v":{"$error":"#N/A"}}]
[]
[null,null,null,null,null,null,null,null,null,36,"CBS/SR",25,440,30,null,"I° APPARECCHIATURA",{"$f":"VLOOKUP(C$16,L174:N176,2,FALSE)","v":440},{"$f":"VLOOKUP(C$16,L174:N176,3,FALSE)","v":30}]
[null,null,null,null,null,null,null,null,null,null,null,50,1800,30,null,"II° APPARECCHIATURA",{"$f":"VLOOKUP(C$17,L174:N176,2,FALSE)","v":4200},{"$f":"VLOOKUP(C$17,L174:N176,3,FALSE)","v":30}]
[null,null,null,null,null,null,null,null,null,null,null,80,4200,30,null,"III° APPARECCHIATURA",{"$f":"VLOOKUP(C$18,L174:N176,2,FALSE)","v":{"$error":"#N/A"}},{"$f":"VLOOKUP(C$18,L174:N176,3,FALSE)","v":{"$error":"#N/A"}}]
[]
[null,null,null,null,null,null,null,null,null,37,"CCS/SR",25,440,30,null,"I° APPARECCHIATURA",{"$f":"VLOOKUP(C$16,L178:N180,2,FALSE)","v":440},{"$f":"VLOOKUP(C$16,L178:N180,3,FALSE)","v":30}]
[null,null,null,null,null,null,null,null,null,null,null,50,1800,30,null,"II° APPARECCHIATURA",{"$f":"VLOOKUP(C$17,L178:N180,2,FALSE)","v":4200},{"$f":"VLOOKUP(C$17,L178:N180,3,FALSE)","v":30}]
[null,null,null,null,null,null,null,null,null,null,null,80,4200,30,null,"III° APPARECCHIATURA",{"$f":"VLOOKUP(C$18,L178:N180,2,FALSE)","v":{"$error":"#N/A"}},{"$f":"VLOOKUP(C$18,L178:N180,3,FALSE)","v":{"$error":"#N/A"}}]
[]
[null,null,null,null,null,null,null,null,null,38,"CCBS/SR",25,430,31,null,"I° APPARECCHIATURA",{"$f":"VLOOKUP(C$16,L182:N184,2,FALSE)","v":430},{"$f":"VLOOKUP(C$16,L182:N184,3,FALSE)","v":31}]
[null,null,null,null,null,null,null,null,null,null,null,50,1750,31,null,"II° APPARECCHIATURA",{"$f":"VLOOKUP(C$17,L182:N184,2,FALSE)","v":4100},{"$f":"VLOOKUP(C$17,L182:N184,3,FALSE)","v":31}]
[null,null,null,null,null,null,null,null,null,null,null,80,4100,31,null,"III° APPARECCHIATURA",{"$f":"VLOOKUP(C$18,L182:N184,2,FALSE)","v":{"$error":"#N/A"}},{"$f":"VLOOKUP(C$18,L182:N184,3,FALSE)","v":{"$error":"#N/A"}}]
[]
[null,null,null,null,null,null,null,null,null,39,"CBS/SRS",25,400,33,null,"I° APPARECCHIATURA",{"$f":"VLOOKUP(C$16,L186:N188,2,FALSE)","v":400},{"$f":"VLOOKUP(C$16,L186:N188,3,FALSE)","v":33}]
[null,null,null,null,null,null,null,null,null,null,null,50,1650,32,null,"II° APPARECCHIATURA",{"$f":"VLOOKUP(C$17,L186:N188,2,FALSE)","v":3500},{"$f":"VLOOKUP(C$17,L186:N188,3,FALSE)","v":33}]
[null,null,null,null,null,null,null,null,null,null,null,80,3500,33,null,"III° APPARECCHIATURA",{"$f":"VLOOKUP(C$18,L186:N188,2,FALSE)","v":{"$error":"#N/A"}},{"$f":"VLOOKUP(C$18,L186:N188,3,FALSE)","v":{"$error":"#N/A"}}]
[]
[null,null,null,null,null,null,null,null,null,40,"CCS/SRS",25,400,33,null,"I° APPARECCHIATURA",{"$f":"VLOOKUP(C$16,L190:N192,2,FALSE)","v":400},{"$f":"VLOOKUP(C$16,L190:N192,3,FALSE)","v":33}]
[null,null,null,null,null,null,null,null,null,null,null,50,1650,32,null,"II° APPARECCHIATURA",{"$f":"VLOOKUP(C$17,L190:N192,2,FALSE)","v":3500},{"$f":"VLOOKUP(C$17,L190:N192,3,FALSE)","v":33}]
[null,null,null,null,null,null,null,null,null,null,null,80,3500,33,null,"III° APPARECCHIATURA",{"$f":"VLOOKUP(C$18,L190:N192,2,FALSE)","v":{"$error":"#N/A"}},{"$f":"VLOOKUP(C$18,L190:N192,3,FALSE)","v":{"$error":"#N/A"}}]
[]
[null,null,null,null,null,null,null,null,null,41,"CCBS/SRS",25,390,34,null,"I° APPARECCHIATURA",{"$f":"VLOOKUP(C$16,L194:N196,2,FALSE)","v":390},{"$f":"VLOOKUP(C$16,L194:N196,3,FALSE)","v":34}]
[null,null,null,null,null,null,null,null,null,null,null,50,1600,33,null,"II° APPARECCHIATURA",{"$f":"VLOOKUP(C$17,L194:N196,2,FALSE)","v":3400},{"$f":"VLOOKUP(C$17,L194:N196,3,FALSE)","v":34}]
[null,null,null,null,null,null,null,null,null,null,null,80,3400,34,null,"III° APPARECCHIATURA",{"$f":"VLOOKUP(C$18,L194:N196,2,FALSE)","v":{"$error":"#N/A"}},{"$f":"VLOOKUP(C$18,L194:N196,3,FALSE)","v":{"$error":"#N/A"}}]
[]
[null,null,null,null,null,null,null,null,null,42,"CBS all.",25,475,30,null,"I° APPARECCHIATURA",{"$f":"VLOOKUP(C$16,L198:N200,2,FALSE)","v":475},{"$f":"VLOOKUP(C$16,L198:N200,3,FALSE)","v":30}]
[null,null,null,null,null,null,null,null,null,null,null,50,1900,30,null,"II° APPARECCHIATURA",{"$f":"VLOOKUP(C$17,L198:N200,2,FALSE)","v":4400},{"$f":"VLOOKUP(C$17,L198:N200,3,FALSE)","v":30}]
[null,null,null,null,null,null,null,null,null,null,null,80,4400,30,null,"III° APPARECCHIATURA",{"$f":"VLOOKUP(C$18,L198:N200,2,FALSE)","v":{"$error":"#N/A"}},{"$f":"VLOOKUP(C$18,L198:N200,3,FALSE)","v":{"$error":"#N/A"}}]
[]
[null,null,null,null,null,null,null,null,null,43,"CCS all.",25,475,30,null,"I° APPARECCHIATURA",{"$f":"VLOOKUP(C$16,L202:N204,2,FALSE)","v":475},{"$f":"VLOOKUP(C$16,L202:N204,3,FALSE)","v":30}]
[null,null,null,null,null,null,null,null,null,null,null,50,1900,30,null,"II° APPARECCHIATURA",{"$f":"VLOOKUP(C$17,L202:N204,2,FALSE)","v":4400},{"$f":"VLOOKUP(C$17,L202:N204,3,FALSE)","v":30}]
[null,null,null,null,null,null,null,null,null,null,null,80,4400,30,null,"III° APPARECCHIATURA",{"$f":"VLOOKUP(C$18,L202:N204,2,FALSE)","v":{"$error":"#N/A"}},{"$f":"VLOOKUP(C$18,L202:N204,3,FALSE)","v":{"$error":"#N/A"}}]
[]
[null,null,null,null,null,null,null,null,null,44,"CCBS all.",25,470,31,null,"I° APPARECCHIATURA",{"$f":"VLOOKUP(C$16,L206:N208,2,FALSE)","v":470},{"$f":"VLOOKUP(C$16,L206:N208,3,FALSE)","v":31}]
[null,null,null,null,null,null,null,null,null,null,null,50,1850,31,null,"II° APPARECCHIATURA",{"$f":"VLOOKUP(C$17,L206:N208,2,FALSE)","v":4300},{"$f":"VLOOKUP(C$17,L206:N208,3,FALSE)","v":31}]
[null,null,null,null,null,null,null,null,null,null,null,80,4300,31,null,"III° APPARECCHIATURA",{"$f":"VLOOKUP(C$18,L206:N208,2,FALSE)","v":{"$error":"#N/A"}},{"$f":"VLOOKUP(C$18,L206:N208,3,FALSE)","v":{"$error":"#N/A"}}]

{"sheet":"РЕД-1","index":2,"n_rows":252,"n_cols":25,"rows_kept":252,"cut":false,"hidden":true,"merged":[]}
["Таблица расходов фильтров РЕД"]
[]
[null,"DP",10,{"$f":"IF(AND(V10>C3,V10<E3)=TRUE,V10,0)","v":0},25,{"$f":"IF(AND(V10>E3,V10<G3)=TRUE,V10,0)","v":0},50,{"$f":"IF(AND(V10>G3,V10<I3)=TRUE,V10,0)","v":0},75,{"$f":"IF(AND(V10>I3,V10<K3)=TRUE,V10,0)","v":0},100,{"$f":"IF(AND(V10>K3,V10<M3)=TRUE,V10,0)","v":0},150,{"$f":"IF(AND(V10>M3,V10<O3)=TRUE,V10,0)","v":0},250,{"$f":"IF(AND(V10>O3,V10<Q3)=TRUE,V10,0)","v":0},500]
["PM"]
[]
[0.5,null,75,{"$f":"(E6-C6)/(E3-C3)*(D3-C3)+C6","v":51.666666666666664},110,{"$f":"(G6-E6)/(G3-E3)*(F3-E3)+E6","v":100},120,{"$f":"(I6-G6)/(I3-G3)*(H3-G3)+G6","v":119.80000000000001},120.1,{"$f":"(K6-I6)/(K3-I3)*(J3-I3)+I6","v":119.79999999999997},120.2,{"$f":"(M6-K6)/(M3-K3)*(L3-K3)+K6","v":120.00000000000001},120.3,{"$f":"(O6-M6)/(O3-M3)*(N3-M3)+M6","v":120.14999999999998},120.4,{"$f":"(Q6-O6)/(Q3-O3)*(P3-O3)+O6","v":120.31000000000002},120.49,null,"PM","Q","Qcal","DPcal","DP","TIPO"]
[{"$f":"IF(AND(S10>A6,S10<A8)=TRUE,S10,0)","v":0},null,{"$f":"(C8-C6)/(A8-A6)*(A7-A6)+C6","v":60},{"$f":"(E7-C7)/(E3-C3)*(D3-C3)+C7","v":46.666666666666671},{"$f":"(E8-E6)/(A8-A6)*(A7-A6)+E6","v":80},{"$f":"(G7-E7)/(G3-E3)*(F3-E3)+E7","v":90},{"$f":"(G8-G6)/(A8-A6)*(A7-A6)+G6","v":70},{"$f":"(I7-G7)/(I3-G3)*(H3-G3)+G7","v":69.800000000000011},{"$f":"(I8-I6)/(A8-A6)*(A7-A6)+I6","v":70.099999999999994},{"$f":"(K7-I7)/(K3-I3)*(J3-I3)+I7","v":69.799999999999926},{"$f":"(K8-K6)/(A8-A6)*(A7-A6)+K6","v":70.200000000000017},{"$f":"(M7-K7)/(M3-K3)*(L3-K3)+K7","v":70.000000000000085},{"$f":"(M8-M6)/(A8-A6)*(A7-A6)+M6","v":70.299999999999983},{"$f":"(O7-M7)/(O3-M3)*(N3-M3)+M7","v":70.149999999999949},{"$f":"(O8-O6)/(A8-A6)*(A7-A6)+O6","v":70.400000000000006},{"$f":"(Q7-O7)/(Q3-O3)*(P3-O3)+O7","v":70.310000000000031},{"$f":"(Q8-Q6)/(A8-A6)*(A7-A6)+Q6","v":70.489999999999981}]
[1,null,90,{"$f":"(E8-C8)/(E3-C3)*(D3-C3)+C8","v":56.666666666666664},140,{"$f":"(G8-E8)/(G3-E3)*(F3-E3)+E8","v":110},170,{"$f":"(I8-G8)/(I3-G3)*(H3-G3)+G8","v":169.8},170.1,{"$f":"(K8-I8)/(K3-I3)*(J3-I3)+I8","v":169.8},170.2,{"$f":"(M8-K8)/(M3-K3)*(L3-K3)+K8","v":169.99999999999994},170.3,{"$f":"(O8-M8)/(O3-M3)*(N3-M3)+M8","v":170.15000000000003},170.4,{"$f":"(Q8-O8)/(Q3-O3)*(P3-O3)+O8","v":170.31},170.49,null,null,"нм3/час","нм3/час","мбар","мбар"]
[{"$f":"IF(AND(S10>A8,S10<A10)=TRUE,S10,0)","v":0},null,{"$f":"(C10-C8)/(A10-A8)*(A9-A8)+C8","v":70},{"$f":"(E9-C9)/(E3-C3)*(D3-C3)+C9","v":43.333333333333336},{"$f":"(E10-E8)/(A10-A8)*(A9-A8)+E8","v":110},{"$f":"(G9-E9)/(G3-E3)*(F3-E3)+E9","v":130},{"$f":"(G10-G8)/(A10-A8)*(A9-A8)+G8","v":90},{"$f":"(I9-G9)/(I3-G3)*(H3-G3)+G9","v":89.800000000000011},{"$f":"(I10-I8)/(A10-A8)*(A9-A8)+I8","v":90.1},{"$f":"(K9-I9)/(K3-I3)*(J3-I3)+I9","v":89.800000000000011},{"$f":"(K10-K8)/(A10-A8)*(A9-A8)+K8","v":90.199999999999989},{"$f":"(M9-K9)/(M3-K3)*(L3-K3)+K9","v":89.999999999999943},{"$f":"(M10-M8)/(A10-A8)*(A9-A8)+M8","v":90.300000000000011},{"$f":"(O9-M9)/(O3-M3)*(N3-M3)+M9","v":90.15000000000002},{"$f":"(O10-O8)/(A10-A8)*(A9-A8)+O8","v":90.4},{"$f":"(Q9-O9)/(Q3-O3)*(P3-O3)+O9","v":90.31},{"$f":"(Q10-Q8)/(A10-A8)*(A9-A8)+Q8","v":90.490000000000009}]
[2,null,110,{"$f":"(E10-C10)/(E3-C3)*(D3-C3)+C10","v":70},170,{"$f":"(G10-E10)/(G3-E3)*(F3-E3)+E10","v":90},250,{"$f":"(I10-G10)/(I3-G3)*(H3-G3)+G10","v":249.8},250.1,{"$f":"(K10-I10)/(K3-I3)*(J3-I3)+I10","v":249.8},250.2,{"$f":"(M10-K10)/(M3-K3)*(L3-K3)+K10","v":249.99999999999994},250.3,{"$f":"(O10-M10)/(O3-M3)*(N3-M3)+M10","v":250.15000000000003},250.4,{"$f":"(Q10-O10)/(Q3-O3)*(P3-O3)+O10","v":250.31},250.49,null,{"$f":"Лист1!B17*10","v":0.1},{"$f":"Лист1!B19","v":3500},{"$f":"VLOOKUP(S10,A3:Q18,HLOOKUP(V10,A3:Q18,16,0),0)","v":{"$error":"#N/A"}},{"$f":"Лист1!B18*10","v":100},{"$f":"IF(S10<A6,\"NO\",IF(S10>A16,\"N0\",IF(VLOOKUP(S10,A6:Q16,3,0)>T10,\"NO\",IF(VLOOKUP(S10,A6:Q16,17,0)<T10,\"NO\",IF(AND(U10>=T10-0.1,U10<T10+0.1)=TRUE,V10,\"NO\")))))","v":"NO"},"Фильтр газовый",{"$f":"Лист1!F7","v":"РЕД-С-0,5-1-50 DN50"}]
[{"$f":"IF(AND(S10>A10,S10<A12)=TRUE,S10,0)","v":0},null,{"$f":"(C12-C10)/(A12-A10)*(A11-A10)+C10","v":83.333333333333329},{"$f":"(E11-C11)/(E3-C3)*(D3-C3)+C11","v":38.888888888888886},{"$f":"(E12-E10)/(A12-A10)*(A11-A10)+E10","v":150},{"$f":"(G11-E11)/(G3-E3)*(F3-E3)+E11","v":116.66666666666669},{"$f":"(G12-G10)/(A12-A10)*(A11-A10)+G10","v":183.33333333333331},{"$f":"(I11-G11)/(I3-G3)*(H3-G3)+G11","v":216.33333333333331},{"$f":"(I12-I10)/(A12-A10)*(A11-A10)+I10","v":166.83333333333331},{"$f":"(K11-I11)/(K3-I3)*(J3-I3)+I11","v":416.33333333333326},{"$f":"(K12-K10)/(A12-A10)*(A11-A10)+K10","v":83.666666666666657},{"$f":"(M11-K11)/(M3-K3)*(L3-K3)+K11","v":83.466666666666612},{"$f":"(M12-M10)/(A12-A10)*(A11-A10)+M10","v":83.76666666666668},{"$f":"(O11-M11)/(O3-M3)*(N3-M3)+M11","v":83.616666666666688},{"$f":"(O12-O10)/(A12-A10)*(A11-A10)+O10","v":83.866666666666674},{"$f":"(Q11-O11)/(Q3-O3)*(P3-O3)+O11","v":83.716666666666669},{"$f":"(Q12-Q10)/(A12-A10)*(A11-A10)+Q10","v":84.01666666666668}]
[5,null,150,{"$f":"(E12-C12)/(E3-C3)*(D3-C3)+C12","v":116.66666666666666},200,{"$f":"(G12-E12)/(G3-E3)*(F3-E3)+E12","v":50},350,{"$f":"(I12-G12)/(I3-G3)*(H3-G3)+G12","v":300},375,{"$f":"(K12-I12)/(K3-I3)*(J3-I3)+I12","v":0},500,{"$f":"(M12-K12)/(M3-K3)*(L3-K3)+K12","v":499.79999999999995},500.1,{"$f":"(O12-M12)/(O3-M3)*(N3-M3)+M12","v":499.95000000000005},500.2,{"$f":"(Q12-O12)/(Q3-O3)*(P3-O3)+O12","v":500.2},500.2]
[{"$f":"IF(AND(S10>A12,S10<A14)=TRUE,S10,0)","v":0},null,{"$f":"(C14-C12)/(A14-A12)*(A13-A12)+C12","v":50},{"$f":"(E13-C13)/(E3-C3)*(D3-C3)+C13","v":36.666666666666671},{"$f":"(E14-E12)/(A14-A12)*(A13-A12)+E12","v":70},{"$f":"(G13-E13)/(G3-E3)*(F3-E3)+E13","v":-140},{"$f":"(G14-G12)/(A14-A12)*(A13-A12)+G12","v":280},{"$f":"(I13-G13)/(I3-G3)*(H3-G3)+G13","v":400},{"$f":"(I14-I12)/(A14-A12)*(A13-A12)+I12","v":220},{"$f":"(K13-I13)/(K3-I3)*(J3-I3)+I13","v":-170},{"$f":"(K14-K12)/(A14-A12)*(A13-A12)+K12","v":350},{"$f":"(M13-K13)/(M3-K3)*(L3-K3)+K13","v":449.59999999999991},{"$f":"(M14-M12)/(A14-A12)*(A13-A12)+M12","v":300.20000000000005},{"$f":"(O13-M13)/(O3-M3)*(N3-M3)+M13","v":300.05000000000018},{"$f":"(O14-O12)/(A14-A12)*(A13-A12)+O12","v":300.29999999999995},{"$f":"(Q13-O13)/(Q3-O3)*(P3-O3)+O13","v":300.29999999999995},{"$f":"(Q14-Q12)/(A14-A12)*(A13-A12)+Q12","v":300.29999999999995}]
[10,null,250,{"$f":"(E14-C14)/(E3-C3)*(D3-C3)+C14","v":196.66666666666669},330,{"$f":"(G14-E14)/(G3-E3)*(F3-E3)+E14","v":240},420,{"$f":"(I14-G14)/(I3-G3)*(H3-G3)+G14","v":199.99999999999997},530,{"$f":"(K14-I14)/(K3-I3)*(J3-I3)+I14","v":170},650,{"$f":"(M14-K14)/(M3-K3)*(L3-K3)+K14","v":550},700,{"$f":"(O14-M14)/(O3-M3)*(N3-M3)+M14","v":699.84999999999991},700.1,{"$f":"(Q14-O14)/(Q3-O3)*(P3-O3)+O14","v":700.1},700.1]
[{"$f":"IF(AND(S10>A14,S10<A16)=TRUE,S10,0)","v":0},null,{"$f":"(C16-C14)/(A16-A14)*(A15-A14)+C14","v":166.66666666666666},{"$f":"(E15-C15)/(E3-C3)*(D3-C3)+C15","v":146.66666666666666},{"$f":"(E16-E14)/(A16-A14)*(A15-A14)+E14","v":196.66666666666666},{"$f":"(G15-E15)/(G3-E3)*(F3-E3)+E15","v":148.33333333333331},{"$f":"(G16-G14)/(A16-A14)*(A15-A14)+G14","v":245},{"$f":"(I15-G15)/(I3-G3)*(H3-G3)+G15","v":24.999999999999972},{"$f":"(I16-I14)/(A16-A14)*(A15-A14)+I14","v":355},{"$f":"(K15-I15)/(K3-I3)*(J3-I3)+I15","v":-29.999999999999943},{"$f":"(K16-K14)/(A16-A14)*(A15-A14)+K14","v":483.33333333333331},{"$f":"(M15-K15)/(M3-K3)*(L3-K3)+K15","v":633.33333333333326},{"$f":"(M16-M14)/(A16-A14)*(A15-A14)+M14","v":408.33333333333331},{"$f":"(O15-M15)/(O3-M3)*(N3-M3)+M15","v":720.43333333333317},{"$f":"(O16-O14)/(A16-A14)*(A15-A14)+O14","v":200.26666666666677},{"$f":"(Q15-O15)/(Q3-O3)*(P3-O3)+O15","v":200.43333333333351},{"$f":"(Q16-Q14)/(A16-A14)*(A15-A14)+Q14","v":200.10000000000002}]
[16,null,300,{"$f":"(E16-C16)/(E3-C3)*(D3-C3)+C16","v":226.66666666666669},410,{"$f":"(G16-E16)/(G3-E3)*(F3-E3)+E16","v":295},525,{"$f":"(I16-G16)/(I3-G3)*(H3-G3)+G16","v":305},635,{"$f":"(K16-I16)/(K3-I3)*(J3-I3)+I16","v":290},750,{"$f":"(M16-K16)/(M3-K3)*(L3-K3)+K16","v":500},875,{"$f":"(O16-M16)/(O3-M3)*(N3-M3)+M16","v":687.5},1000,{"$f":"(Q16-O16)/(Q3-O3)*(P3-O3)+O16","v":999.9},1000.1]
[]
["COL",null,3,4,5,6,7,8,9,10,11,12,13,14,15,16,17]
[]
[]
[null,"DP",10,{"$f":"IF(AND(V28>C21,V28<E21)=TRUE,V28,0)","v":0},25,{"$f":"IF(AND(V28>E21,V28<G21)=TRUE,V28,0)","v":0},50,{"$f":"IF(AND(V28>G21,V28<I21)=TRUE,V28,0)","v":0},75,{"$f":"IF(AND(V28>I21,V28<K21)=TRUE,V28,0)","v":0},100,{"$f":"IF(AND(V28>K21,V28<M21)=TRUE,V28,0)","v":0},150,{"$f":"IF(AND(V28>M21,V28<O21)=TRUE,V28,0)","v":0},250,{"$f":"IF(AND(V28>O21,V28<Q21)=TRUE,V28,0)","v":0},500]
["PM"]
[]
[0.5,null,150,{"$f":"(E24-C24)/(E21-C21)*(D21-C21)+C24","v":103.33333333333333},220,{"$f":"(G24-E24)/(G21-E21)*(F21-E21)+E24","v":100},340,{"$f":"(I24-G24)/(I21-G21)*(H21-G21)+G24","v":220},400,{"$f":"(K24-I24)/(K21-I21)*(J21-I21)+I24","v":399.69999999999993},400.1,{"$f":"(M24-K24)/(M21-K21)*(L21-K21)+K24","v":399.90000000000009},400.2,{"$f":"(O24-M24)/(O21-M21)*(N21-M21)+M24","v":400.04999999999995},400.3,{"$f":"(Q24-O24)/(Q21-O21)*(P21-O21)+O24","v":400.20000000000005},400.4,null,"PM","Q","Qcal","DPcal","DP","TIPO"]
[{"$f":"IF(AND(S28>A24,S28<A26)=TRUE,S28,0)","v":0},null,{"$f":"(C26-C24)/(A26-A24)*(A25-A24)+C24","v":120},{"$f":"(E25-C25)/(E21-C21)*(D21-C21)+C25","v":93.333333333333343},{"$f":"(E26-E24)/(A26-A24)*(A25-A24)+E24","v":160},{"$f":"(G25-E25)/(G21-E21)*(F21-E21)+E25","v":40},{"$f":"(G26-G24)/(A26-A24)*(A25-A24)+G24","v":280},{"$f":"(I25-G25)/(I21-G21)*(H21-G21)+G25","v":140},{"$f":"(I26-I24)/(A26-A24)*(A25-A24)+I24","v":350},{"$f":"(K25-I25)/(K21-I21)*(J21-I21)+I25","v":349.69999999999993},{"$f":"(K26-K24)/(A26-A24)*(A25-A24)+K24","v":350.1},{"$f":"(M25-K25)/(M21-K21)*(L21-K21)+K25","v":349.90000000000009},{"$f":"(M26-M24)/(A26-A24)*(A25-A24)+M24","v":350.2},{"$f":"(O25-M25)/(O21-M21)*(N21-M21)+M25","v":350.04999999999995},{"$f":"(O26-O24)/(A26-A24)*(A25-A24)+O24","v":350.3},{"$f":"(Q25-O25)/(Q21-O21)*(P21-O21)+O25","v":350.20000000000005},{"$f":"(Q26-Q24)/(A26-A24)*(A25-A24)+Q24","v":350.4}]
[1,null,180,{"$f":"(E26-C26)/(E21-C21)*(D21-C21)+C26","v":113.33333333333333},280,{"$f":"(G26-E26)/(G21-E21)*(F21-E21)+E26","v":160},400,{"$f":"(I26-G26)/(I21-G21)*(H21-G21)+G26","v":300},450,{"$f":"(K26-I26)/(K21-I21)*(J21-I21)+I26","v":449.69999999999993},450.1,{"$f":"(M26-K26)/(M21-K21)*(L21-K21)+K26","v":449.90000000000009},450.2,{"$f":"(O26-M26)/(O21-M21)*(N21-M21)+M26","v":450.04999999999995},450.3,{"$f":"(Q26-O26)/(Q21-O21)*(P21-O21)+O26","v":450.20000000000005},450.4,null,null,"нм3/час","нм3/час","мбар","мбар"]
[{"$f":"IF(AND(S28>A26,S28<A28)=TRUE,S28,0)","v":0},null,{"$f":"(C28-C26)/(A28-A26)*(A27-A26)+C26","v":140},{"$f":"(E27-C27)/(E21-C21)*(D21-C21)+C27","v":86.666666666666671},{"$f":"(E28-E26)/(A28-A26)*(A27-A26)+E26","v":220},{"$f":"(G27-E27)/(G21-E21)*(F21-E21)+E27","v":140},{"$f":"(G28-G26)/(A28-A26)*(A27-A26)+G26","v":300},{"$f":"(I27-G27)/(I21-G21)*(H21-G21)+G27","v":300},{"$f":"(I28-I26)/(A28-A26)*(A27-A26)+I26","v":300},{"$f":"(K27-I27)/(K21-I21)*(J21-I21)+I27","v":599.39999999999986},{"$f":"(K28-K26)/(A28-A26)*(A27-A26)+K26","v":200.20000000000005},{"$f":"(M27-K27)/(M21-K21)*(L21-K21)+K27","v":200.00000000000023},{"$f":"(M28-M26)/(A28-A26)*(A27-A26)+M26","v":200.29999999999995},{"$f":"(O27-M27)/(O21-M21)*(N21-M21)+M27","v":200.14999999999992},{"$f":"(O28-O26)/(A28-A26)*(A27-A26)+O26","v":200.39999999999998},{"$f":"(Q27-O27)/(Q21-O21)*(P21-O21)+O27","v":200.29999999999995},{"$f":"(Q28-Q26)/(A28-A26)*(A27-A26)+Q26","v":200.5}]
[2,null,220,{"$f":"(E28-C28)/(E21-C21)*(D21-C21)+C28","v":140},340,{"$f":"(G28-E28)/(G21-E21)*(F21-E21)+E28","v":180},500,{"$f":"(I28-G28)/(I21-G21)*(H21-G21)+G28","v":300},600,{"$f":"(K28-I28)/(K21-I21)*(J21-I21)+I28","v":300},700,{"$f":"(M28-K28)/(M21-K21)*(L21-K21)+K28","v":699.8},700.1,{"$f":"(O28-M28)/(O21-M21)*(N21-M21)+M28","v":699.95},700.2,{"$f":"(Q28-O28)/(Q21-O21)*(P21-O21)+O28","v":700.10000000000014},700.3,null,{"$f":"Лист1!B17*10","v":0.1},{"$f":"Лист1!B19","v":3500},{"$f":"VLOOKUP(S28,A21:Q36,HLOOKUP(V28,A21:Q36,16,0),0)","v":{"$error":"#N/A"}},{"$f":"Лист1!B18*10","v":100},{"$f":"IF(S28<A24,\"NO\",IF(S28>A34,\"N0\",IF(VLOOKUP(S28,A24:Q34,3,0)>T28,\"NO\",IF(VLOOKUP(S28,A24:Q34,17,0)<T28,\"NO\",IF(AND(U28>=T28-0.1,U28<T28+0.1)=TRUE,V28,\"NO\")))))","v":"NO"},"Фильтр газовый",{"$f":"Лист1!F8","v":"РЕД-С-1,0-1-65 DN65"}]
[{"$f":"IF(AND(S28>A28,S28<A30)=TRUE,S28,0)","v":0},null,{"$f":"(C30-C28)/(A30-A28)*(A29-A28)+C28","v":153.33333333333331},{"$f":"(E29-C29)/(E21-C21)*(D21-C21)+C29","v":99.999999999999986},{"$f":"(E30-E28)/(A30-A28)*(A29-A28)+E28","v":233.33333333333331},{"$f":"(G29-E29)/(G21-E21)*(F21-E21)+E29","v":100},{"$f":"(G30-G28)/(A30-A28)*(A29-A28)+G28","v":366.66666666666663},{"$f":"(I29-G29)/(I21-G21)*(H21-G21)+G29","v":99.999999999999886},{"$f":"(I30-I28)/(A30-A28)*(A29-A28)+I28","v":500},{"$f":"(K29-I29)/(K21-I21)*(J21-I21)+I29","v":500},{"$f":"(K30-K28)/(A30-A28)*(A29-A28)+K28","v":500},{"$f":"(M29-K29)/(M21-K21)*(L21-K21)+K29","v":766.33333333333326},{"$f":"(M30-M28)/(A30-A28)*(A29-A28)+M28","v":366.83333333333337},{"$f":"(O29-M29)/(O21-M21)*(N21-M21)+M29","v":366.68333333333328},{"$f":"(O30-O28)/(A30-A28)*(A29-A28)+O28","v":366.93333333333345},{"$f":"(Q29-O29)/(Q21-O21)*(P21-O21)+O29","v":366.83333333333366},{"$f":"(Q30-Q28)/(A30-A28)*(A29-A28)+Q28","v":367.03333333333325}]
[5,null,320,{"$f":"(E30-C30)/(E21-C21)*(D21-C21)+C30","v":200},500,{"$f":"(G30-E30)/(G21-E21)*(F21-E21)+E30","v":300},700,{"$f":"(I30-G30)/(I21-G21)*(H21-G21)+G30","v":600},750,{"$f":"(K30-I30)/(K21-I21)*(J21-I21)+I30","v":0},1000,{"$f":"(M30-K30)/(M21-K21)*(L21-K21)+K30","v":600},1200,{"$f":"(O30-M30)/(O21-M21)*(N21-M21)+M30","v":1199.8500000000001},1200.0999999999999,{"$f":"(Q30-O30)/(Q21-O21)*(P21-O21)+O30","v":1199.9999999999998},1200.2]
[{"$f":"IF(AND(S28>A30,S28<A32)=TRUE,S28,0)","v":0},null,{"$f":"(C32-C30)/(A32-A30)*(A31-A30)+C30","v":190},{"$f":"(E31-C31)/(E21-C21)*(D21-C21)+C31","v":83.333333333333343},{"$f":"(E32-E30)/(A32-A30)*(A31-A30)+E30","v":350},{"$f":"(G31-E31)/(G21-E21)*(F21-E21)+E31","v":300},{"$f":"(G32-G30)/(A32-A30)*(A31-A30)+G30","v":400},{"$f":"(I31-G31)/(I21-G21)*(H21-G21)+G31","v":600},{"$f":"(I32-I30)/(A32-A30)*(A31-A30)+I30","v":300},{"$f":"(K31-I31)/(K21-I21)*(J21-I21)+I31","v":-900},{"$f":"(K32-K30)/(A32-A30)*(A31-A30)+K30","v":700},{"$f":"(M31-K31)/(M21-K21)*(L21-K21)+K31","v":500},{"$f":"(M32-M30)/(A32-A30)*(A31-A30)+M30","v":800},{"$f":"(O31-M31)/(O21-M21)*(N21-M21)+M31","v":1699.7000000000003},{"$f":"(O32-O30)/(A32-A30)*(A31-A30)+O30","v":200.19999999999982},{"$f":"(Q31-O31)/(Q21-O21)*(P21-O21)+O31","v":200.09999999999945},{"$f":"(Q32-Q30)/(A32-A30)*(A31-A30)+Q30","v":200.30000000000018}]
[10,null,450,{"$f":"(E32-C32)/(E21-C21)*(D21-C21)+C32","v":316.66666666666663},650,{"$f":"(G32-E32)/(G21-E21)*(F21-E21)+E32","v":300},1000,{"$f":"(I32-G32)/(I21-G21)*(H21-G21)+G32","v":600},1200,{"$f":"(K32-I32)/(K21-I21)*(J21-I21)+I32","v":900},1300,{"$f":"(M32-K32)/(M21-K21)*(L21-K21)+K32","v":700},1600,{"$f":"(O32-M32)/(O21-M21)*(N21-M21)+M32","v":700},2200,{"$f":"(Q32-O32)/(Q21-O21)*(P21-O21)+O32","v":2199.9},2200.1]
[{"$f":"IF(AND(S28>A32,S28<A34)=TRUE,S28,0)","v":0},null,{"$f":"(C34-C32)/(A34-A32)*(A33-A32)+C32","v":283.33333333333331},{"$f":"(E33-C33)/(E21-C21)*(D21-C21)+C33","v":205.55555555555551},{"$f":"(E34-E32)/(A34-A32)*(A33-A32)+E32","v":400},{"$f":"(G33-E33)/(G21-E21)*(F21-E21)+E33","v":133.33333333333337},{"$f":"(G34-G32)/(A34-A32)*(A33-A32)+G32","v":666.66666666666663},{"$f":"(I33-G33)/(I21-G21)*(H21-G21)+G33","v":599.99999999999989},{"$f":"(I34-I32)/(A34-A32)*(A33-A32)+I32","v":700},{"$f":"(K33-I33)/(K21-I21)*(J21-I21)+I33","v":900.00000000000023},{"$f":"(K34-K32)/(A34-A32)*(A33-A32)+K32","v":633.33333333333326},{"$f":"(M33-K33)/(M21-K21)*(L21-K21)+K33","v":33.333333333333258},{"$f":"(M34-M32)/(A34-A32)*(A33-A32)+M32","v":933.33333333333326},{"$f":"(O33-M33)/(O21-M21)*(N21-M21)+M33","v":408.33333333333326},{"$f":"(O34-O32)/(A34-A32)*(A33-A32)+O32","v":1283.3333333333333},{"$f":"(Q33-O33)/(Q21-O21)*(P21-O21)+O33","v":3033.0666666666671},{"$f":"(Q34-Q32)/(A34-A32)*(A33-A32)+Q32","v":-466.40000000000055}]
[16,null,550,{"$f":"(E34-C34)/(E21-C21)*(D21-C21)+C34","v":383.33333333333331},800,{"$f":"(G34-E34)/(G21-E21)*(F21-E21)+E34","v":400},1200,{"$f":"(I34-G34)/(I21-G21)*(H21-G21)+G34","v":600},1500,{"$f":"(K34-I34)/(K21-I21)*(J21-I21)+I34","v":900},1700,{"$f":"(M34-K34)/(M21-K21)*(L21-K21)+K34","v":1100},2000,{"$f":"(O34-M34)/(O21-M21)*(N21-M21)+M34","v":875},2750,{"$f":"(Q34-O34)/(Q21-O21)*(P21-O21)+O34","v":1700},3800]
[]
["COL",null,3,4,5,6,7,8,9,10,11,12,13,14,15,16,17]
[]
[]
[null,"DP",10,{"$f":"IF(AND(V46>C39,V46<E39)=TRUE,V46,0)","v":0},25,{"$f":"IF(AND(V46>E39,V46<G39)=TRUE,V46,0)","v":0},50,{"$f":"IF(AND(V46>G39,V46<I39)=TRUE,V46,0)","v":0},75,{"$f":"IF(AND(V46>I39,V46<K39)=TRUE,V46,0)","v":0},100,{"$f":"IF(AND(V46>K39,V46<M39)=TRUE,V46,0)","v":0},150,{"$f":"IF(AND(V46>M39,V46<O39)=TRUE,V46,0)","v":0},250,{"$f":"IF(AND(V46>O39,V46<Q39)=TRUE,V46,0)","v":0},500]
["PM"]
[]
[0.5,null,300,{"$f":"(E42-C42)/(E39-C39)*(D39-C39)+C42","v":213.33333333333334},430,{"$f":"(G42-E42)/(G39-E39)*(F39-E39)+E42","v":209.99999999999997},650,{"$f":"(I42-G42)/(I39-G39)*(H39-G39)+G42","v":350},800,{"$f":"(K42-I42)/(K39-I39)*(J39-I39)+I42","v":799.69999999999993},800.1,{"$f":"(M42-K42)/(M39-K39)*(L39-K39)+K42","v":799.9},800.2,{"$f":"(O42-M42)/(O39-M39)*(N39-M39)+M42","v":800.05000000000018},800.3,{"$f":"(Q42-O42)/(Q39-O39)*(P39-O39)+O42","v":800.19999999999993},800.4,null,"PM","Q","Qcal","DPcal","DP","TIPO"]
[{"$f":"IF(AND(S46>A42,S46<A44)=TRUE,S46,0)","v":0},null,{"$f":"(C44-C42)/(A44-A42)*(A43-A42)+C42","v":260},{"$f":"(E43-C43)/(E39-C39)*(D39-C39)+C43","v":226.66666666666666},{"$f":"(E44-E42)/(A44-A42)*(A43-A42)+E42","v":310},{"$f":"(G43-E43)/(G39-E39)*(F39-E39)+E43","v":70},{"$f":"(G44-G42)/(A44-A42)*(A43-A42)+G42","v":550},{"$f":"(I43-G43)/(I39-G39)*(H39-G39)+G43","v":250},{"$f":"(I44-I42)/(A44-A42)*(A43-A42)+I42","v":700},{"$f":"(K43-I43)/(K39-I39)*(J39-I39)+I43","v":699.69999999999993},{"$f":"(K44-K42)/(A44-A42)*(A43-A42)+K42","v":700.1},{"$f":"(M43-K43)/(M39-K39)*(L39-K39)+K43","v":699.9},{"$f":"(M44-M42)/(A44-A42)*(A43-A42)+M42","v":700.2},{"$f":"(O43-M43)/(O39-M39)*(N39-M39)+M43","v":700.05000000000018},{"$f":"(O44-O42)/(A44-A42)*(A43-A42)+O42","v":700.3},{"$f":"(Q43-O43)/(Q39-O39)*(P39-O39)+O43","v":700.19999999999993},{"$f":"(Q44-Q42)/(A44-A42)*(A43-A42)+Q42","v":700.4}]
[1,null,340,{"$f":"(E44-C44)/(E39-C39)*(D39-C39)+C44","v":200},550,{"$f":"(G44-E44)/(G39-E39)*(F39-E39)+E44","v":350},750,{"$f":"(I44-G44)/(I39-G39)*(H39-G39)+G44","v":450},900,{"$f":"(K44-I44)/(K39-I39)*(J39-I39)+I44","v":899.69999999999993},900.1,{"$f":"(M44-K44)/(M39-K39)*(L39-K39)+K44","v":899.9},900.2,{"$f":"(O44-M44)/(O39-M39)*(N39-M39)+M44","v":900.05000000000018},900.3,{"$f":"(Q44-O44)/(Q39-O39)*(P39-O39)+O44","v":900.19999999999993},900.4,null,null,"нм3/час","нм3/час","мбар","мбар"]
[{"$f":"IF(AND(S46>A44,S46<A46)=TRUE,S46,0)","v":0},null,{"$f":"(C46-C44)/(A46-A44)*(A45-A44)+C44","v":280},{"$f":"(E45-C45)/(E39-C39)*(D39-C39)+C45","v":166.66666666666666},{"$f":"(E46-E44)/(A46-A44)*(A45-A44)+E44","v":450},{"$f":"(G45-E45)/(G39-E39)*(F39-E39)+E45","v":350},{"$f":"(G46-G44)/(A46-A44)*(A45-A44)+G44","v":550},{"$f":"(I45-G45)/(I39-G39)*(H39-G39)+G45","v":250},{"$f":"(I46-I44)/(A46-A44)*(A45-A44)+I44","v":700},{"$f":"(K45-I45)/(K39-I39)*(J39-I39)+I45","v":1299.3999999999999},{"$f":"(K46-K44)/(A46-A44)*(A45-A44)+K44","v":500.20000000000005},{"$f":"(M45-K45)/(M39-K39)*(L39-K39)+K45","v":499.99999999999977},{"$f":"(M46-M44)/(A46-A44)*(A45-A44)+M44","v":500.30000000000018},{"$f":"(O45-M45)/(O39-M39)*(N39-M39)+M45","v":500.15000000000066},{"$f":"(O46-O44)/(A46-A44)*(A45-A44)+O44","v":500.39999999999986},{"$f":"(Q45-O45)/(Q39-O39)*(P39-O39)+O45","v":500.29999999999973},{"$f":"(Q46-Q44)/(A46-A44)*(A45-A44)+Q44","v":500.5}]
[2,null,400,{"$f":"(E46-C46)/(E39-C39)*(D39-C39)+C46","v":233.33333333333331},650,{"$f":"(G46-E46)/(G39-E39)*(F39-E39)+E46","v":350},950,{"$f":"(I46-G46)/(I39-G39)*(H39-G39)+G46","v":650},1100,{"$f":"(K46-I46)/(K39-I39)*(J39-I39)+I46","v":500},1300,{"$f":"(M46-K46)/(M39-K39)*(L39-K39)+K46","v":1299.8000000000002},1300.0999999999999,{"$f":"(O46-M46)/(O39-M39)*(N39-M39)+M46","v":1299.9499999999998},1300.2,{"$f":"(Q46-O46)/(Q39-O39)*(P39-O39)+O46","v":1300.1000000000001},1300.3,null,{"$f":"Лист1!B17*10","v":0.1},{"$f":"Лист1!B19","v":3500},{"$f":"VLOOKUP(S46,A39:Q54,HLOOKUP(V46,A39:Q54,16,0),0)","v":{"$error":"#N/A"}},{"$f":"Лист1!B18*10","v":100},{"$f":"IF(S46<A42,\"NO\",IF(S46>A52,\"N0\",IF(VLOOKUP(S46,A42:Q52,3,0)>T46,\"NO\",IF(VLOOKUP(S46,A42:Q52,17,0)<T46,\"NO\",IF(AND(U46>=T46-0.1,U46<T46+0.1)=TRUE,V46,\"NO\")))))","v":"NO"},"Фильтр газовый",{"$f":"Лист1!F9","v":"РЕД-С-1,5-1-80 DN80"}]
[{"$f":"IF(AND(S46>A46,S46<A48)=TRUE,S46,0)","v":0},null,{"$f":"(C48-C46)/(A48-A46)*(A47-A46)+C46","v":266.66666666666663},{"$f":"(E47-C47)/(E39-C39)*(D39-C39)+C47","v":122.22222222222211},{"$f":"(E48-E46)/(A48-A46)*(A47-A46)+E46","v":483.33333333333337},{"$f":"(G47-E47)/(G39-E39)*(F39-E39)+E47","v":250.00000000000011},{"$f":"(G48-G46)/(A48-A46)*(A47-A46)+G46","v":716.66666666666663},{"$f":"(I47-G47)/(I39-G39)*(H39-G39)+G47","v":616.6666666666664},{"$f":"(I48-I46)/(A48-A46)*(A47-A46)+I46","v":766.66666666666674},{"$f":"(K47-I47)/(K39-I39)*(J39-I39)+I47","v":366.66666666666697},{"$f":"(K48-K46)/(A48-A46)*(A47-A46)+K46","v":900},{"$f":"(M47-K47)/(M39-K39)*(L39-K39)+K47","v":1299.666666666667},{"$f":"(M48-M46)/(A48-A46)*(A47-A46)+M46","v":700.16666666666652},{"$f":"(O47-M47)/(O39-M39)*(N39-M39)+M47","v":700.0166666666662},{"$f":"(O48-O46)/(A48-A46)*(A47-A46)+O46","v":700.26666666666677},{"$f":"(Q47-O47)/(Q39-O39)*(P39-O39)+O47","v":700.16666666666686},{"$f":"(Q48-Q46)/(A48-A46)*(A47-A46)+Q46","v":700.36666666666667}]
[5,null,600,{"$f":"(E48-C48)/(E39-C39)*(D39-C39)+C48","v":400},900,{"$f":"(G48-E48)/(G39-E39)*(F39-E39)+E48","v":500},1300,{"$f":"(I48-G48)/(I39-G39)*(H39-G39)+G48","v":700},1600,{"$f":"(K48-I48)/(K39-I39)*(J39-I39)+I48","v":700},1900,{"$f":"(M48-K48)/(M39-K39)*(L39-K39)+K48","v":1300},2200,{"$f":"(O48-M48)/(O39-M39)*(N39-M39)+M48","v":2199.8500000000004},2200.1,{"$f":"(Q48-O48)/(Q39-O39)*(P39-O39)+O48","v":2200},2200.1999999999998]
[{"$f":"IF(AND(S46>A48,S46<A50)=TRUE,S46,0)","v":0},null,{"$f":"(C50-C48)/(A50-A48)*(A49-A48)+C48","v":350},{"$f":"(E49-C49)/(E39-C39)*(D39-C39)+C49","v":183.33333333333331},{"$f":"(E50-E48)/(A50-A48)*(A49-A48)+E48","v":600},{"$f":"(G49-E49)/(G39-E39)*(F39-E39)+E49","v":400},{"$f":"(G50-G48)/(A50-A48)*(A49-A48)+G48","v":800},{"$f":"(I49-G49)/(I39-G39)*(H39-G39)+G49","v":400},{"$f":"(I50-I48)/(A50-A48)*(A49-A48)+I48","v":1000},{"$f":"(K49-I49)/(K39-I39)*(J39-I39)+I49","v":100},{"$f":"(K50-K48)/(A50-A48)*(A49-A48)+K48","v":1300},{"$f":"(M49-K49)/(M39-K39)*(L39-K39)+K49","v":1100},{"$f":"(M50-M48)/(A50-A48)*(A49-A48)+M48","v":1400},{"$f":"(O49-M49)/(O39-M39)*(N39-M39)+M49","v":2524.7000000000003},{"$f":"(O50-O48)/(A50-A48)*(A49-A48)+O48","v":650.19999999999982},{"$f":"(Q49-O49)/(Q39-O39)*(P39-O39)+O49","v":650.09999999999991},{"$f":"(Q50-Q48)/(A50-A48)*(A49-A48)+Q48","v":650.29999999999973}]
[10,null,850,{"$f":"(E50-C50)/(E39-C39)*(D39-C39)+C50","v":616.66666666666674},1200,{"$f":"(G50-E50)/(G39-E39)*(F39-E39)+E50","v":600},1800,{"$f":"(I50-G50)/(I39-G39)*(H39-G39)+G50","v":1000},2200,{"$f":"(K50-I50)/(K39-I39)*(J39-I39)+I50","v":1300},2500,{"$f":"(M50-K50)/(M39-K39)*(L39-K39)+K50","v":1500},3000,{"$f":"(O50-M50)/(O39-M39)*(N39-M39)+M50","v":1875},3750,{"$f":"(Q50-O50)/(Q39-O39)*(P39-O39)+O50","v":3749.9},3750.1]
[{"$f":"IF(AND(S46>A50,S46<A52)=TRUE,S46,0)","v":0},null,{"$f":"(C52-C50)/(A52-A50)*(A51-A50)+C50","v":600},{"$f":"(E51-C51)/(E39-C39)*(D39-C39)+C51","v":422.22222222222229},{"$f":"(E52-E50)/(A52-A50)*(A51-A50)+E50","v":866.66666666666663},{"$f":"(G51-E51)/(G39-E39)*(F39-E39)+E51","v":600},{"$f":"(G52-G50)/(A52-A50)*(A51-A50)+G50","v":1133.3333333333333},{"$f":"(I51-G51)/(I39-G39)*(H39-G39)+G51","v":999.99999999999977},{"$f":"(I52-I50)/(A52-A50)*(A51-A50)+I50","v":1200},{"$f":"(K51-I51)/(K39-I39)*(J39-I39)+I51","v":800.00000000000023},{"$f":"(K52-K50)/(A52-A50)*(A51-A50)+K50","v":1333.3333333333333},{"$f":"(M51-K51)/(M39-K39)*(L39-K39)+K51","v":1333.3333333333328},{"$f":"(M52-M50)/(A52-A50)*(A51-A50)+M50","v":1333.3333333333335},{"$f":"(O51-M51)/(O39-M39)*(N39-M39)+M51","v":-416.66666666666606},{"$f":"(O52-O50)/(A52-A50)*(A51-A50)+O50","v":2500},{"$f":"(Q51-O51)/(Q39-O39)*(P39-O39)+O51","v":4999.7333333333336},{"$f":"(Q52-Q50)/(A52-A50)*(A51-A50)+Q50","v":0.26666666666642413}]
[16,null,1000,{"$f":"(E52-C52)/(E39-C39)*(D39-C39)+C52","v":733.33333333333326},1400,{"$f":"(G52-E52)/(G39-E39)*(F39-E39)+E52","v":600},2200,{"$f":"(I52-G52)/(I39-G39)*(H39-G39)+G52","v":1000},2800,{"$f":"(K52-I52)/(K39-I39)*(J39-I39)+I52","v":1600},3200,{"$f":"(M52-K52)/(M39-K39)*(L39-K39)+K52","v":1600},4000,{"$f":"(O52-M52)/(O39-M39)*(N39-M39)+M52","v":3250},4500,{"$f":"(Q52-O52)/(Q39-O39)*(P39-O39)+O52","v":3000},6000]
[]
["COL",null,3,4,5,6,7,8,9,10,11,12,13,14,15,16,17]
[]
[]
[null,"DP",10,{"$f":"IF(AND(V64>C57,V64<E57)=TRUE,V64,0)","v":0},25,{"$f":"IF(AND(V64>E57,V64<G57)=TRUE,V64,0)","v":0},50,{"$f":"IF(AND(V64>G57,V64<I57)=TRUE,V64,0)","v":0},75,{"$f":"IF(AND(V64>I57,V64<K57)=TRUE,V64,0)","v":0},100,{"$f":"IF(AND(V64>K57,V64<M57)=TRUE,V64,0)","v":0},150,{"$f":"IF(AND(V64>M57,V64<O57)=TRUE,V64,0)","v":0},250,{"$f":"IF(AND(V64>O57,V64<Q57)=TRUE,V64,0)","v":0},500]
["PM"]
[]
[0.5,null,600,{"$f":"(E60-C60)/(E57-C57)*(D57-C57)+C60","v":400},900,{"$f":"(G60-E60)/(G57-E57)*(F57-E57)+E60","v":500},1300,{"$f":"(I60-G60)/(I57-G57)*(H57-G57)+G60","v":1299.8000000000002},1300.0999999999999,{"$f":"(K60-I60)/(K57-I57)*(J57-I57)+I60","v":1299.7999999999995},1300.2,{"$f":"(M60-K60)/(M57-K57)*(L57-K57)+K60","v":1300.0000000000002},1300.3,{"$f":"(O60-M60)/(O57-M57)*(N57-M57)+M60","v":1300.1499999999996},1300.4000000000001,{"$f":"(Q60-O60)/(Q57-O57)*(P57-O57)+O60","v":1300.3100000000002},1300.49,null,"PM","Q","Qcal","DPcal","DP","TIPO"]
[{"$f":"IF(AND(S64>A60,S64<A62)=TRUE,S64,0)","v":0},null,{"$f":"(C62-C60)/(A62-A60)*(A61-A60)+C60","v":500},{"$f":"(E61-C61)/(E57-C57)*(D57-C57)+C61","v":366.66666666666663},{"$f":"(E62-E60)/(A62-A60)*(A61-A60)+E60","v":700},{"$f":"(G61-E61)/(G57-E57)*(F57-E57)+E61","v":300},{"$f":"(G62-G60)/(A62-A60)*(A61-A60)+G60","v":1100},{"$f":"(I61-G61)/(I57-G57)*(H57-G57)+G61","v":1499.6000000000004},{"$f":"(I62-I60)/(A62-A60)*(A61-A60)+I60","v":900.19999999999982},{"$f":"(K61-I61)/(K57-I57)*(J57-I57)+I61","v":899.89999999999873},{"$f":"(K62-K60)/(A62-A60)*(A61-A60)+K60","v":900.30000000000018},{"$f":"(M61-K61)/(M57-K57)*(L57-K57)+K61","v":900.10000000000082},{"$f":"(M62-M60)/(A62-A60)*(A61-A60)+M60","v":900.39999999999986},{"$f":"(O61-M61)/(O57-M57)*(N57-M57)+M61","v":900.24999999999932},{"$f":"(O62-O60)/(A62-A60)*(A61-A60)+O60","v":900.50000000000023},{"$f":"(Q61-O61)/(Q57-O57)*(P57-O57)+O61","v":900.42000000000053},{"$f":"(Q62-Q60)/(A62-A60)*(A61-A60)+Q60","v":900.57999999999993}]
[1,null,700,{"$f":"(E62-C62)/(E57-C57)*(D57-C57)+C62","v":433.33333333333331},1100,{"$f":"(G62-E62)/(G57-E57)*(F57-E57)+E62","v":700},1500,{"$f":"(I62-G62)/(I57-G57)*(H57-G57)+G62","v":1100},1700,{"$f":"(K62-I62)/(K57-I57)*(J57-I57)+I62","v":1699.7000000000003},1700.1,{"$f":"(M62-K62)/(M57-K57)*(L57-K57)+K62","v":1699.8999999999996},1700.2,{"$f":"(O62-M62)/(O57-M57)*(N57-M57)+M62","v":1700.0500000000002},1700.3,{"$f":"(Q62-O62)/(Q57-O57)*(P57-O57)+O62","v":1700.1999999999998},1700.4,null,null,"нм3/час","нм3/час","мбар","мбар"]
[{"$f":"IF(AND(S64>A62,S64<A64)=TRUE,S64,0)","v":0},null,{"$f":"(C64-C62)/(A64-A62)*(A63-A62)+C62","v":550},{"$f":"(E63-C63)/(E57-C57)*(D57-C57)+C63","v":316.66666666666669},{"$f":"(E64-E62)/(A64-A62)*(A63-A62)+E62","v":900},{"$f":"(G63-E63)/(G57-E57)*(F57-E57)+E63","v":700},{"$f":"(G64-G62)/(A64-A62)*(A63-A62)+G62","v":1100},{"$f":"(I63-G63)/(I57-G57)*(H57-G57)+G63","v":900},{"$f":"(I64-I62)/(A64-A62)*(A63-A62)+I62","v":1200},{"$f":"(K63-I63)/(K57-I57)*(J57-I57)+I63","v":1199.7000000000003},{"$f":"(K64-K62)/(A64-A62)*(A63-A62)+K62","v":1200.0999999999999},{"$f":"(M63-K63)/(M57-K57)*(L57-K57)+K63","v":1199.8999999999992},{"$f":"(M64-M62)/(A64-A62)*(A63-A62)+M62","v":1200.2000000000003},{"$f":"(O63-M63)/(O57-M57)*(N57-M57)+M63","v":1200.0500000000011},{"$f":"(O64-O62)/(A64-A62)*(A63-A62)+O62","v":1200.2999999999997},{"$f":"(Q63-O63)/(Q57-O57)*(P57-O57)+O63","v":1200.1999999999994},{"$f":"(Q64-Q62)/(A64-A62)*(A63-A62)+Q62","v":1200.4000000000001}]
[2,null,850,{"$f":"(E64-C64)/(E57-C57)*(D57-C57)+C64","v":550},1300,{"$f":"(G64-E64)/(G57-E57)*(F57-E57)+E64","v":700},1900,{"$f":"(I64-G64)/(I57-G57)*(H57-G57)+G64","v":1300},2200,{"$f":"(K64-I64)/(K57-I57)*(J57-I57)+I64","v":2199.7000000000003},2200.1,{"$f":"(M64-K64)/(M57-K57)*(L57-K57)+K64","v":2199.9},2200.1999999999998,{"$f":"(O64-M64)/(O57-M57)*(N57-M57)+M64","v":2200.0499999999993},2200.3000000000002,{"$f":"(Q64-O64)/(Q57-O57)*(P57-O57)+O64","v":2200.2000000000003},2200.4,null,{"$f":"Лист1!B17*10","v":0.1},{"$f":"Лист1!B19","v":3500},{"$f":"VLOOKUP(S64,A57:Q72,HLOOKUP(V64,A57:Q72,16,0),0)","v":{"$error":"#N/A"}},{"$f":"Лист1!B18*10","v":100},{"$f":"IF(S64<A60,\"NO\",IF(S64>A70,\"N0\",IF(VLOOKUP(S64,A60:Q70,3,0)>T64,\"NO\",IF(VLOOKUP(S64,A60:Q70,17,0)<T64,\"NO\",IF(AND(U64>=T64-0.1,U64<T64+0.1)=TRUE,V64,\"NO\")))))","v":"NO"},"Фильтр газовый",{"$f":"Лист1!F10","v":"РЕД-С-2,0-1-100 DN100"}]
[{"$f":"IF(AND(S64>A64,S64<A66)=TRUE,S64,0)","v":0},null,{"$f":"(C66-C64)/(A66-A64)*(A65-A64)+C64","v":850},{"$f":"(E65-C65)/(E57-C57)*(D57-C57)+C65","v":550},{"$f":"(E66-E64)/(A66-A64)*(A65-A64)+E64","v":1300},{"$f":"(G65-E65)/(G57-E57)*(F57-E57)+E65","v":1266.6666666666665},{"$f":"(G66-G64)/(A66-A64)*(A65-A64)+G64","v":1333.3333333333335},{"$f":"(I65-G65)/(I57-G57)*(H57-G57)+G65","v":933.33333333333348},{"$f":"(I66-I64)/(A66-A64)*(A65-A64)+I64","v":1533.3333333333335},{"$f":"(K65-I65)/(K57-I57)*(J57-I57)+I65","v":2632.8333333333339},{"$f":"(K66-K64)/(A66-A64)*(A65-A64)+K64","v":1166.8333333333333},{"$f":"(M65-K65)/(M57-K57)*(L57-K57)+K65","v":2499.8333333333339},{"$f":"(M66-M64)/(A66-A64)*(A65-A64)+M64","v":500.33333333333303},{"$f":"(O65-M65)/(O57-M57)*(N57-M57)+M65","v":500.08333333333223},{"$f":"(O66-O64)/(A66-A64)*(A65-A64)+O64","v":500.50000000000023},{"$f":"(Q65-O65)/(Q57-O57)*(P57-O57)+O65","v":500.33333333333371},{"$f":"(Q66-Q64)/(A66-A64)*(A65-A64)+Q64","v":500.66666666666674}]
[5,null,850,{"$f":"(E66-C66)/(E57-C57)*(D57-C57)+C66","v":550},1300,{"$f":"(G66-E66)/(G57-E57)*(F57-E57)+E66","v":-150},2750,{"$f":"(I66-G66)/(I57-G57)*(H57-G57)+G66","v":1850},3200,{"$f":"(K66-I66)/(K57-I57)*(J57-I57)+I66","v":1550},3750,{"$f":"(M66-K66)/(M57-K57)*(L57-K57)+K66","v":1750},4750,{"$f":"(O66-M66)/(O57-M57)*(N57-M57)+M66","v":4750},4750,{"$f":"(Q66-O66)/(Q57-O57)*(P57-O57)+O66","v":4750},4750]
[{"$f":"IF(AND(S64>A66,S64<A68)=TRUE,S64,0)","v":0},null,{"$f":"(C68-C66)/(A68-A66)*(A67-A66)+C66","v":500},{"$f":"(E67-C67)/(E57-C57)*(D57-C57)+C67","v":300},{"$f":"(E68-E66)/(A68-A66)*(A67-A66)+E66","v":800},{"$f":"(G67-E67)/(G57-E57)*(F57-E57)+E67","v":-900},{"$f":"(G68-G66)/(A68-A66)*(A67-A66)+G66","v":2500},{"$f":"(I67-G67)/(I57-G57)*(H57-G57)+G67","v":1700},{"$f":"(I68-I66)/(A68-A66)*(A67-A66)+I66","v":2900},{"$f":"(K67-I67)/(K57-I57)*(J57-I57)+I67","v":4100},{"$f":"(K68-K66)/(A68-A66)*(A67-A66)+K66","v":2500},{"$f":"(M67-K67)/(M57-K57)*(L57-K57)+K67","v":1000},{"$f":"(M68-M66)/(A68-A66)*(A67-A66)+M66","v":3250},{"$f":"(O67-M67)/(O57-M57)*(N57-M57)+M67","v":6625},{"$f":"(O68-O66)/(A68-A66)*(A67-A66)+O66","v":1000},{"$f":"(Q67-O67)/(Q57-O57)*(P57-O57)+O67","v":-3749.8999999999996},{"$f":"(Q68-Q66)/(A68-A66)*(A67-A66)+Q66","v":5749.9}]
[10,null,1200,{"$f":"(E68-C68)/(E57-C57)*(D57-C57)+C68","v":800},1800,{"$f":"(G68-E68)/(G57-E57)*(F57-E57)+E68","v":600},3000,{"$f":"(I68-G68)/(I57-G57)*(H57-G57)+G68","v":2000},3500,{"$f":"(K68-I68)/(K57-I57)*(J57-I57)+I68","v":-1000},5000,{"$f":"(M68-K68)/(M57-K57)*(L57-K57)+K68","v":2500},6250,{"$f":"(O68-M68)/(O57-M57)*(N57-M57)+M68","v":2875},8500,{"$f":"(Q68-O68)/(Q57-O57)*(P57-O57)+O68","v":13249.9},3750.1]
[{"$f":"IF(AND(S64>A68,S64<A70)=TRUE,S64,0)","v":0},null,{"$f":"(C70-C68)/(A70-A68)*(A69-A68)+C68","v":866.66666666666663},{"$f":"(E69-C69)/(E57-C57)*(D57-C57)+C69","v":688.88888888888891},{"$f":"(E70-E68)/(A70-A68)*(A69-A68)+E68","v":1133.3333333333333},{"$f":"(G69-E69)/(G57-E57)*(F57-E57)+E69","v":-400},{"$f":"(G70-G68)/(A70-A68)*(A69-A68)+G68","v":2666.6666666666665},{"$f":"(I69-G69)/(I57-G57)*(H57-G57)+G69","v":2666.6666666666656},{"$f":"(I70-I68)/(A70-A68)*(A69-A68)+I68","v":2666.666666666667},{"$f":"(K69-I69)/(K57-I57)*(J57-I57)+I69","v":-1833.333333333333},{"$f":"(K70-K68)/(A70-A68)*(A69-A68)+K68","v":4166.666666666667},{"$f":"(M69-K69)/(M57-K57)*(L57-K57)+K69","v":833.33333333333485},{"$f":"(M70-M68)/(A70-A68)*(A69-A68)+M68","v":5833.333333333333},{"$f":"(O69-M69)/(O57-M57)*(N57-M57)+M69","v":5583.3333333333321},{"$f":"(O70-O68)/(A70-A68)*(A69-A68)+O68","v":6000},{"$f":"(Q69-O69)/(Q57-O57)*(P57-O57)+O69","v":21999.733333333334},{"$f":"(Q70-Q68)/(A70-A68)*(A69-A68)+Q68","v":-9999.7333333333336}]
[16,null,1400,{"$f":"(E70-C70)/(E57-C57)*(D57-C57)+C70","v":866.66666666666663},2200,{"$f":"(G70-E70)/(G57-E57)*(F57-E57)+E70","v":1200},3200,{"$f":"(I70-G70)/(I57-G57)*(H57-G57)+G70","v":1600},4000,{"$f":"(K70-I70)/(K57-I57)*(J57-I57)+I70","v":-500},5500,{"$f":"(M70-K70)/(M57-K57)*(L57-K57)+K70","v":3500},6500,{"$f":"(O70-M70)/(O57-M57)*(N57-M57)+M70","v":1250},10000,{"$f":"(Q70-O70)/(Q57-O57)*(P57-O57)+O70","v":8000},12000]
[]
["COL",null,3,4,5,6,7,8,9,10,11,12,13,14,15,16,17]
[]
[]
[null,"DP",10,{"$f":"IF(AND(V82>C75,V82<E75)=TRUE,V82,0)","v":0},25,{"$f":"IF(AND(V82>E75,V82<G75)=TRUE,V82,0)","v":0},50,{"$f":"IF(AND(V82>G75,V82<I75)=TRUE,V82,0)","v":0},75,{"$f":"IF(AND(V82>I75,V82<K75)=TRUE,V82,0)","v":0},100,{"$f":"IF(AND(V82>K75,V82<M75)=TRUE,V82,0)","v":0},150,{"$f":"IF(AND(V82>M75,V82<O75)=TRUE,V82,0)","v":0},250,{"$f":"IF(AND(V82>O75,V82<Q75)=TRUE,V82,0)","v":0},500]
["PM"]
[]
[0.5,null,900,{"$f":"(E78-C78)/(E75-C75)*(D75-C75)+C78","v":633.33333333333326},1300,{"$f":"(G78-E78)/(G75-E75)*(F75-E75)+E78","v":600},2000,{"$f":"(I78-G78)/(I75-G75)*(H75-G75)+G78","v":1999.8000000000002},2000.1,{"$f":"(K78-I78)/(K75-I75)*(J75-I75)+I78","v":1999.7999999999995},2000.2,{"$f":"(M78-K78)/(M75-K75)*(L75-K75)+K78","v":2000.0000000000002},2000.3,{"$f":"(O78-M78)/(O75-M75)*(N75-M75)+M78","v":2000.1499999999996},2000.4,{"$f":"(Q78-O78)/(Q75-O75)*(P75-O75)+O78","v":2000.3100000000002},2000.49,null,"PM","Q","Qcal","DPcal","DP","TIPO"]
[{"$f":"IF(AND(S82>A78,S82<A80)=TRUE,S82,0)","v":0},null,{"$f":"(C80-C78)/(A80-A78)*(A79-A78)+C78","v":800},{"$f":"(E79-C79)/(E75-C75)*(D75-C75)+C79","v":666.66666666666663},{"$f":"(E80-E78)/(A80-A78)*(A79-A78)+E78","v":1000},{"$f":"(G79-E79)/(G75-E75)*(F75-E75)+E79","v":750},{"$f":"(G80-G78)/(A80-A78)*(A79-A78)+G78","v":1250},{"$f":"(I79-G79)/(I75-G75)*(H75-G75)+G79","v":1249.8000000000002},{"$f":"(I80-I78)/(A80-A78)*(A79-A78)+I78","v":1250.0999999999999},{"$f":"(K79-I79)/(K75-I75)*(J75-I75)+I79","v":1249.7999999999988},{"$f":"(K80-K78)/(A80-A78)*(A79-A78)+K78","v":1250.2000000000003},{"$f":"(M79-K79)/(M75-K75)*(L75-K75)+K79","v":1250.0000000000014},{"$f":"(M80-M78)/(A80-A78)*(A79-A78)+M78","v":1250.2999999999997},{"$f":"(O79-M79)/(O75-M75)*(N75-M75)+M79","v":1250.1499999999992},{"$f":"(O80-O78)/(A80-A78)*(A79-A78)+O78","v":1250.4000000000001},{"$f":"(Q79-O79)/(Q75-O75)*(P75-O75)+O79","v":1250.31},{"$f":"(Q80-Q78)/(A80-A78)*(A79-A78)+Q78","v":1250.4900000000002}]
[1,null,1000,{"$f":"(E80-C80)/(E75-C75)*(D75-C75)+C80","v":600},1600,{"$f":"(G80-E80)/(G75-E75)*(F75-E75)+E80","v":450},2750,{"$f":"(I80-G80)/(I75-G75)*(H75-G75)+G80","v":2749.8},2750.1,{"$f":"(K80-I80)/(K75-I75)*(J75-I75)+I80","v":2749.8},2750.2,{"$f":"(M80-K80)/(M75-K75)*(L75-K75)+K80","v":2749.9999999999991},2750.3,{"$f":"(O80-M80)/(O75-M75)*(N75-M75)+M80","v":2750.1500000000005},2750.4,{"$f":"(Q80-O80)/(Q75-O75)*(P75-O75)+O80","v":2750.3100000000004},2750.49,null,null,"нм3/час","нм3/час","мбар","мбар"]
[{"$f":"IF(AND(S82>A80,S82<A82)=TRUE,S82,0)","v":0},null,{"$f":"(C82-C80)/(A82-A80)*(A81-A80)+C80","v":750},{"$f":"(E81-C81)/(E75-C75)*(D75-C75)+C81","v":450},{"$f":"(E82-E80)/(A82-A80)*(A81-A80)+E80","v":1200},{"$f":"(G81-E81)/(G75-E75)*(F75-E75)+E81","v":-300},{"$f":"(G82-G80)/(A82-A80)*(A81-A80)+G80","v":2700},{"$f":"(I81-G81)/(I75-G75)*(H75-G75)+G81","v":3099.6000000000004},{"$f":"(I82-I80)/(A82-A80)*(A81-A80)+I80","v":2500.1999999999998},{"$f":"(K81-I81)/(K75-I75)*(J75-I75)+I81","v":3999.6000000000004},{"$f":"(K82-K80)/(A82-A80)*(A81-A80)+K80","v":2000.3999999999996},{"$f":"(M81-K81)/(M75-K75)*(L75-K75)+K81","v":2000.199999999998},{"$f":"(M82-M80)/(A82-A80)*(A81-A80)+M80","v":2000.5000000000005},{"$f":"(O81-M81)/(O75-M75)*(N75-M75)+M81","v":2000.3500000000006},{"$f":"(O82-O80)/(A82-A80)*(A81-A80)+O80","v":2000.6000000000004},{"$f":"(Q81-O81)/(Q75-O75)*(P75-O75)+O81","v":2000.5200000000013},{"$f":"(Q82-Q80)/(A82-A80)*(A81-A80)+Q80","v":2000.6799999999994}]
[2,null,1250,{"$f":"(E82-C82)/(E75-C75)*(D75-C75)+C82","v":750},2000,{"$f":"(G82-E82)/(G75-E75)*(F75-E75)+E82","v":1200},2800,{"$f":"(I82-G82)/(I75-G75)*(H75-G75)+G82","v":2400},3000,{"$f":"(K82-I82)/(K75-I75)*(J75-I75)+I82","v":1500},3500,{"$f":"(M82-K82)/(M75-K75)*(L75-K75)+K82","v":3499.8},3500.1,{"$f":"(O82-M82)/(O75-M75)*(N75-M75)+M82","v":3499.95},3500.2,{"$f":"(Q82-O82)/(Q75-O75)*(P75-O75)+O82","v":3500.0999999999995},3500.3,null,{"$f":"Лист1!B17*10","v":0.1},{"$f":"Лист1!B19","v":3500},{"$f":"VLOOKUP(S82,A75:Q90,HLOOKUP(V82,A75:Q90,16,0),0)","v":{"$error":"#N/A"}},{"$f":"Лист1!B18*10","v":100},{"$f":"IF(S82<A78,\"NO\",IF(S82>A88,\"N0\",IF(VLOOKUP(S82,A78:Q88,3,0)>T82,\"NO\",IF(VLOOKUP(S82,A78:Q88,17,0)<T82,\"NO\",IF(AND(U82>=T82-0.1,U82<T82+0.1)=TRUE,V82,\"NO\")))))","v":"NO"},"Фильтр газовый",{"$f":"Лист1!F11","v":"РЕД-С-2,5-1-125 DN125"}]
[{"$f":"IF(AND(S82>A82,S82<A84)=TRUE,S82,0)","v":0},null,{"$f":"(C84-C82)/(A84-A82)*(A83-A82)+C82","v":1083.3333333333333},{"$f":"(E83-C83)/(E75-C75)*(D75-C75)+C83","v":561.11111111111086},{"$f":"(E84-E82)/(A84-A82)*(A83-A82)+E82","v":1866.6666666666667},{"$f":"(G83-E83)/(G75-E75)*(F75-E75)+E83","v":1733.3333333333335},{"$f":"(G84-G82)/(A84-A82)*(A83-A82)+G82","v":2000},{"$f":"(I83-G83)/(I75-G75)*(H75-G75)+G83","v":2666.6666666666665},{"$f":"(I84-I82)/(A84-A82)*(A83-A82)+I82","v":1666.6666666666667},{"$f":"(K83-I83)/(K75-I75)*(J75-I75)+I83","v":166.66666666666583},{"$f":"(K84-K82)/(A84-A82)*(A83-A82)+K82","v":2166.666666666667},{"$f":"(M83-K83)/(M75-K75)*(L75-K75)+K83","v":2833.0000000000014},{"$f":"(M84-M82)/(A84-A82)*(A83-A82)+M82","v":1833.4999999999998},{"$f":"(O83-M83)/(O75-M75)*(N75-M75)+M83","v":1833.3500000000004},{"$f":"(O84-O82)/(A84-A82)*(A83-A82)+O82","v":1833.5999999999995},{"$f":"(Q83-O83)/(Q75-O75)*(P75-O75)+O83","v":1833.4999999999984},{"$f":"(Q84-Q82)/(A84-A82)*(A83-A82)+Q82","v":1833.7000000000005}]
[5,null,1500,{"$f":"(E84-C84)/(E75-C75)*(D75-C75)+C84","v":1033.3333333333335},2200,{"$f":"(G84-E84)/(G75-E75)*(F75-E75)+E84","v":400},4000,{"$f":"(I84-G84)/(I75-G75)*(H75-G75)+G84","v":2000},5000,{"$f":"(K84-I84)/(K75-I75)*(J75-I75)+I84","v":3500},5500,{"$f":"(M84-K84)/(M75-K75)*(L75-K75)+K84","v":4500},6000,{"$f":"(O84-M84)/(O75-M75)*(N75-M75)+M84","v":5999.8499999999995},6000.1,{"$f":"(Q84-O84)/(Q75-O75)*(P75-O75)+O84","v":6000.0000000000009},6000.2]
[{"$f":"IF(AND(S82>A84,S82<A86)=TRUE,S82,0)","v":0},null,{"$f":"(C86-C84)/(A86-A84)*(A85-A84)+C84","v":800},{"$f":"(E85-C85)/(E75-C75)*(D75-C75)+C85","v":533.33333333333326},{"$f":"(E86-E84)/(A86-A84)*(A85-A84)+E84","v":1200},{"$f":"(G85-E85)/(G75-E75)*(F75-E75)+E85","v":-600},{"$f":"(G86-G84)/(A86-A84)*(A85-A84)+G84","v":3000},{"$f":"(I85-G85)/(I75-G75)*(H75-G75)+G85","v":1000},{"$f":"(I86-I84)/(A86-A84)*(A85-A84)+I84","v":4000},{"$f":"(K85-I85)/(K75-I75)*(J75-I75)+I85","v":5500},{"$f":"(K86-K84)/(A86-A84)*(A85-A84)+K84","v":3500},{"$f":"(M85-K85)/(M75-K75)*(L75-K75)+K85","v":3500},{"$f":"(M86-M84)/(A86-A84)*(A85-A84)+M84","v":3500},{"$f":"(O85-M85)/(O75-M75)*(N75-M75)+M85","v":5749.6999999999989},{"$f":"(O86-O84)/(A86-A84)*(A85-A84)+O84","v":2000.2000000000007},{"$f":"(Q85-O85)/(Q75-O75)*(P75-O75)+O85","v":2000.1000000000022},{"$f":"(Q86-Q84)/(A86-A84)*(A85-A84)+Q84","v":2000.2999999999993}]
[10,null,2200,{"$f":"(E86-C86)/(E75-C75)*(D75-C75)+C86","v":1533.3333333333333},3200,{"$f":"(G86-E86)/(G75-E75)*(F75-E75)+E86","v":1400},5000,{"$f":"(I86-G86)/(I75-G75)*(H75-G75)+G86","v":3000},6000,{"$f":"(K86-I86)/(K75-I75)*(J75-I75)+I86","v":1500},7500,{"$f":"(M86-K86)/(M75-K75)*(L75-K75)+K86","v":5500},8500,{"$f":"(O86-M86)/(O75-M75)*(N75-M75)+M86","v":6250},10000,{"$f":"(Q86-O86)/(Q75-O75)*(P75-O75)+O86","v":9999.9},10000.1]
[{"$f":"IF(AND(S82>A86,S82<A88)=TRUE,S82,0)","v":0},null,{"$f":"(C88-C86)/(A88-A86)*(A87-A86)+C86","v":1700},{"$f":"(E87-C87)/(E75-C75)*(D75-C75)+C87","v":1588.8888888888889},{"$f":"(E88-E86)/(A88-A86)*(A87-A86)+E86","v":1866.6666666666665},{"$f":"(G87-E87)/(G75-E75)*(F75-E75)+E87","v":399.99999999999955},{"$f":"(G88-G86)/(A88-A86)*(A87-A86)+G86","v":3333.3333333333335},{"$f":"(I87-G87)/(I75-G75)*(H75-G75)+G87","v":1333.3333333333323},{"$f":"(I88-I86)/(A88-A86)*(A87-A86)+I86","v":4333.3333333333339},{"$f":"(K87-I87)/(K75-I75)*(J75-I75)+I87","v":-2666.6666666666642},{"$f":"(K88-K86)/(A88-A86)*(A87-A86)+K86","v":6666.666666666667},{"$f":"(M87-K87)/(M75-K75)*(L75-K75)+K87","v":8000.0000000000009},{"$f":"(M88-M86)/(A88-A86)*(A87-A86)+M86","v":6000},{"$f":"(O87-M87)/(O75-M75)*(N75-M75)+M87","v":5000},{"$f":"(O88-O86)/(A88-A86)*(A87-A86)+O86","v":6666.666666666667},{"$f":"(Q87-O87)/(Q75-O75)*(P75-O75)+O87","v":16666.400000000001},{"$f":"(Q88-Q86)/(A88-A86)*(A87-A86)+Q86","v":-3333.0666666666657}]
[16,null,2500,{"$f":"(E88-C88)/(E75-C75)*(D75-C75)+C88","v":1500},4000,{"$f":"(G88-E88)/(G75-E75)*(F75-E75)+E88","v":2000},6000,{"$f":"(I88-G88)/(I75-G75)*(H75-G75)+G88","v":4000},7000,{"$f":"(K88-I88)/(K75-I75)*(J75-I75)+I88","v":4000},8000,{"$f":"(M88-K88)/(M75-K75)*(L75-K75)+K88","v":4000},10000,{"$f":"(O88-M88)/(O75-M75)*(N75-M75)+M88","v":7000},12000,{"$f":"(Q88-O88)/(Q75-O75)*(P75-O75)+O88","v":6000},18000]
[]
["COL",null,3,4,5,6,7,8,9,10,11,12,13,14,15,16,17]
[]
[]
[null,"DP",10,{"$f":"IF(AND(V100>C93,V100<E93)=TRUE,V100,0)","v":0},25,{"$f":"IF(AND(V100>E93,V100<G93)=TRUE,V100,0)","v":0},50,{"$f":"IF(AND(V100>G93,V100<I93)=TRUE,V100,0)","v":0},75,{"$f":"IF(AND(V100>I93,V100<K93)=TRUE,V100,0)","v":0},100,{"$f":"IF(AND(V100>K93,V100<M93)=TRUE,V100,0)","v":0},150,{"$f":"IF(AND(V100>M93,V100<O93)=TRUE,V100,0)","v":0},250,{"$f":"IF(AND(V100>O93,V100<Q93)=TRUE,V100,0)","v":0},500]
["PM"]
[]
[0.5,null,1600,{"$f":"(E96-C96)/(E93-C93)*(D93-C93)+C96","v":1000},2500,{"$f":"(G96-E96)/(G93-E93)*(F93-E93)+E96","v":2000},3000,{"$f":"(I96-G96)/(I93-G93)*(H93-G93)+G96","v":2999.8},3000.1,{"$f":"(K96-I96)/(K93-I93)*(J93-I93)+I96","v":2999.8},3000.2,{"$f":"(M96-K96)/(M93-K93)*(L93-K93)+K96","v":2999.9999999999991},3000.3,{"$f":"(O96-M96)/(O93-M93)*(N93-M93)+M96","v":3000.1500000000005},3000.4,{"$f":"(Q96-O96)/(Q93-O93)*(P93-O93)+O96","v":3000.3100000000004},3000.49,null,"PM","Q","Qcal","DPcal","DP","TIPO"]
[{"$f":"IF(AND(S100>A96,S100<A98)=TRUE,S100,0)","v":0},null,{"$f":"(C98-C96)/(A98-A96)*(A97-A96)+C96","v":1300},{"$f":"(E97-C97)/(E93-C93)*(D93-C93)+C97","v":833.33333333333337},{"$f":"(E98-E96)/(A98-A96)*(A97-A96)+E96","v":2000},{"$f":"(G97-E97)/(G93-E93)*(F93-E93)+E97","v":1750},{"$f":"(G98-G96)/(A98-A96)*(A97-A96)+G96","v":2250},{"$f":"(I97-G97)/(I93-G93)*(H93-G93)+G97","v":2249.8000000000002},{"$f":"(I98-I96)/(A98-A96)*(A97-A96)+I96","v":2250.1},{"$f":"(K97-I97)/(K93-I93)*(J93-I93)+I97","v":2249.8000000000002},{"$f":"(K98-K96)/(A98-A96)*(A97-A96)+K96","v":2250.1999999999998},{"$f":"(M97-K97)/(M93-K93)*(L93-K93)+K97","v":2249.9999999999991},{"$f":"(M98-M96)/(A98-A96)*(A97-A96)+M96","v":2250.3000000000002},{"$f":"(O97-M97)/(O93-M93)*(N93-M93)+M97","v":2250.1500000000005},{"$f":"(O98-O96)/(A98-A96)*(A97-A96)+O96","v":2250.4},{"$f":"(Q97-O97)/(Q93-O93)*(P93-O93)+O97","v":2250.3100000000004},{"$f":"(Q98-Q96)/(A98-A96)*(A97-A96)+Q96","v":2250.4899999999998}]
[1,null,1900,{"$f":"(E98-C98)/(E93-C93)*(D93-C93)+C98","v":1166.6666666666667},3000,{"$f":"(G98-E98)/(G93-E93)*(F93-E93)+E98","v":2250},3750,{"$f":"(I98-G98)/(I93-G93)*(H93-G93)+G98","v":3749.8},3750.1,{"$f":"(K98-I98)/(K93-I93)*(J93-I93)+I98","v":3749.8},3750.2,{"$f":"(M98-K98)/(M93-K93)*(L93-K93)+K98","v":3749.9999999999991},3750.3,{"$f":"(O98-M98)/(O93-M93)*(N93-M93)+M98","v":3750.1500000000005},3750.4,{"$f":"(Q98-O98)/(Q93-O93)*(P93-O93)+O98","v":3750.3100000000004},3750.49,null,null,"нм3/час","нм3/час","мбар","мбар"]
[{"$f":"IF(AND(S100>A98,S100<A100)=TRUE,S100,0)","v":0},null,{"$f":"(C100-C98)/(A100-A98)*(A99-A98)+C98","v":1300},{"$f":"(E99-C99)/(E93-C93)*(D93-C93)+C99","v":833.33333333333337},{"$f":"(E100-E98)/(A100-A98)*(A99-A98)+E98","v":2000},{"$f":"(G99-E99)/(G93-E93)*(F93-E93)+E99","v":1000},{"$f":"(G100-G98)/(A100-A98)*(A99-A98)+G98","v":3000},{"$f":"(I99-G99)/(I93-G93)*(H93-G93)+G99","v":3499.6000000000004},{"$f":"(I100-I98)/(A100-A98)*(A99-A98)+I98","v":2750.2},{"$f":"(K99-I99)/(K93-I93)*(J93-I93)+I99","v":4999.6000000000004},{"$f":"(K100-K98)/(A100-A98)*(A99-A98)+K98","v":2000.3999999999996},{"$f":"(M99-K99)/(M93-K93)*(L93-K93)+K99","v":2000.1999999999989},{"$f":"(M100-M98)/(A100-A98)*(A99-A98)+M98","v":2000.5},{"$f":"(O99-M99)/(O93-M93)*(N93-M93)+M99","v":2000.3499999999995},{"$f":"(O100-O98)/(A100-A98)*(A99-A98)+O98","v":2000.6000000000004},{"$f":"(Q99-O99)/(Q93-O93)*(P93-O93)+O99","v":2000.5200000000013},{"$f":"(Q100-Q98)/(A100-A98)*(A99-A98)+Q98","v":2000.6799999999994}]
[2,null,2500,{"$f":"(E100-C100)/(E93-C93)*(D93-C93)+C100","v":1500},4000,{"$f":"(G100-E100)/(G93-E93)*(F93-E93)+E100","v":3500},4500,{"$f":"(I100-G100)/(I93-G93)*(H93-G93)+G100","v":4000},4750,{"$f":"(K100-I100)/(K93-I93)*(J93-I93)+I100","v":2500},5500,{"$f":"(M100-K100)/(M93-K93)*(L93-K93)+K100","v":5499.7999999999993},5500.1,{"$f":"(O100-M100)/(O93-M93)*(N93-M93)+M100","v":5499.9500000000007},5500.2,{"$f":"(Q100-O100)/(Q93-O93)*(P93-O93)+O100","v":5500.0999999999995},5500.3,null,{"$f":"Лист1!B17*10","v":0.1},{"$f":"Лист1!B19","v":3500},{"$f":"VLOOKUP(S100,A93:Q108,HLOOKUP(V100,A93:Q108,16,0),0)","v":{"$error":"#N/A"}},{"$f":"Лист1!B18*10","v":100},{"$f":"IF(S100<A96,\"NO\",IF(S100>A106,\"N0\",IF(VLOOKUP(S100,A96:Q106,3,0)>T100,\"NO\",IF(VLOOKUP(S100,A96:Q106,17,0)<T100,\"NO\",IF(AND(U100>=T100-0.1,U100<T100+0.1)=TRUE,V100,\"NO\")))))","v":"NO"},"Фильтр газовый",{"$f":"Лист1!F12","v":"РЕД-С-3,0-1-150 DN150"}]
[{"$f":"IF(AND(S100>A100,S100<A102)=TRUE,S100,0)","v":0},null,{"$f":"(C102-C100)/(A102-A100)*(A101-A100)+C100","v":2166.6666666666665},{"$f":"(E101-C101)/(E93-C93)*(D93-C93)+C101","v":1166.6666666666665},{"$f":"(E102-E100)/(A102-A100)*(A101-A100)+E100","v":3666.6666666666665},{"$f":"(G101-E101)/(G93-E93)*(F93-E93)+E101","v":4833.333333333333},{"$f":"(G102-G100)/(A102-A100)*(A101-A100)+G100","v":2500},{"$f":"(I101-G101)/(I93-G93)*(H93-G93)+G101","v":3666.666666666667},{"$f":"(I102-I100)/(A102-A100)*(A101-A100)+I100","v":1916.6666666666665},{"$f":"(K101-I101)/(K93-I93)*(J93-I93)+I101","v":166.66666666666606},{"$f":"(K102-K100)/(A102-A100)*(A101-A100)+K100","v":2500},{"$f":"(M101-K101)/(M93-K93)*(L93-K93)+K101","v":3832.9999999999991},{"$f":"(M102-M100)/(A102-A100)*(A101-A100)+M100","v":1833.5000000000005},{"$f":"(O101-M101)/(O93-M93)*(N93-M93)+M101","v":1833.350000000002},{"$f":"(O102-O100)/(A102-A100)*(A101-A100)+O100","v":1833.5999999999995},{"$f":"(Q101-O101)/(Q93-O93)*(P93-O93)+O101","v":1833.4999999999991},{"$f":"(Q102-Q100)/(A102-A100)*(A101-A100)+Q100","v":1833.6999999999998}]
[5,null,3000,{"$f":"(E102-C102)/(E93-C93)*(D93-C93)+C102","v":2000},4500,{"$f":"(G102-E102)/(G93-E93)*(F93-E93)+E102","v":1500},7500,{"$f":"(I102-G102)/(I93-G93)*(H93-G93)+G102","v":4500},9000,{"$f":"(K102-I102)/(K93-I93)*(J93-I93)+I102","v":6000},10000,{"$f":"(M102-K102)/(M93-K93)*(L93-K93)+K102","v":8000},11000,{"$f":"(O102-M102)/(O93-M93)*(N93-M93)+M102","v":10999.849999999999},11000.1,{"$f":"(Q102-O102)/(Q93-O93)*(P93-O93)+O102","v":11000},11000.2]
[{"$f":"IF(AND(S100>A102,S100<A104)=TRUE,S100,0)","v":0},null,{"$f":"(C104-C102)/(A104-A102)*(A103-A102)+C102","v":2500},{"$f":"(E103-C103)/(E93-C93)*(D93-C93)+C103","v":1633.3333333333333},{"$f":"(E104-E102)/(A104-A102)*(A103-A102)+E102","v":3800},{"$f":"(G103-E103)/(G93-E93)*(F93-E93)+E103","v":600},{"$f":"(G104-G102)/(A104-A102)*(A103-A102)+G102","v":7000},{"$f":"(I103-G103)/(I93-G93)*(H93-G93)+G103","v":5000},{"$f":"(I104-I102)/(A104-A102)*(A103-A102)+I102","v":8000},{"$f":"(K103-I103)/(K93-I93)*(J93-I93)+I103","v":8000},{"$f":"(K104-K102)/(A104-A102)*(A103-A102)+K102","v":8000},{"$f":"(M103-K103)/(M93-K93)*(L93-K93)+K103","v":10000},{"$f":"(M104-M102)/(A104-A102)*(A103-A102)+M102","v":7000},{"$f":"(O103-M103)/(O93-M93)*(N93-M93)+M103","v":11499.699999999999},{"$f":"(O104-O102)/(A104-A102)*(A103-A102)+O102","v":4000.2000000000007},{"$f":"(Q103-O103)/(Q93-O93)*(P93-O93)+O103","v":4000.0999999999985},{"$f":"(Q104-Q102)/(A104-A102)*(A103-A102)+Q102","v":4000.3000000000029}]
[10,null,3500,{"$f":"(E104-C104)/(E93-C93)*(D93-C93)+C104","v":2366.666666666667},5200,{"$f":"(G104-E104)/(G93-E93)*(F93-E93)+E104","v":2400},8000,{"$f":"(I104-G104)/(I93-G93)*(H93-G93)+G104","v":4000},10000,{"$f":"(K104-I104)/(K93-I93)*(J93-I93)+I104","v":4000},12000,{"$f":"(M104-K104)/(M93-K93)*(L93-K93)+K104","v":6000},15000,{"$f":"(O104-M104)/(O93-M93)*(N93-M93)+M104","v":10500},18000,{"$f":"(Q104-O104)/(Q93-O93)*(P93-O93)+O104","v":17999.900000000001},18000.099999999999]
[{"$f":"IF(AND(S100>A104,S100<A106)=TRUE,S100,0)","v":0},null,{"$f":"(C106-C104)/(A106-A104)*(A105-A104)+C104","v":2666.666666666667},{"$f":"(E105-C105)/(E93-C93)*(D93-C93)+C105","v":2422.2222222222226},{"$f":"(E106-E104)/(A106-A104)*(A105-A104)+E104","v":3033.3333333333335},{"$f":"(G105-E105)/(G93-E93)*(F93-E93)+E105","v":-266.66666666666742},{"$f":"(G106-G104)/(A106-A104)*(A105-A104)+G104","v":6333.3333333333339},{"$f":"(I105-G105)/(I93-G93)*(H93-G93)+G105","v":5666.6666666666679},{"$f":"(I106-I104)/(A106-A104)*(A105-A104)+I104","v":6666.666666666667},{"$f":"(K105-I105)/(K93-I93)*(J93-I93)+I105","v":-4333.3333333333348},{"$f":"(K106-K104)/(A106-A104)*(A105-A104)+K104","v":10333.333333333334},{"$f":"(M105-K105)/(M93-K93)*(L93-K93)+K105","v":4333.3333333333339},{"$f":"(M106-M104)/(A106-A104)*(A105-A104)+M104","v":13333.333333333334},{"$f":"(O105-M105)/(O93-M93)*(N93-M93)+M105","v":16333.333333333334},{"$f":"(O106-O104)/(A106-A104)*(A105-A104)+O104","v":11333.333333333334},{"$f":"(Q105-O105)/(Q93-O93)*(P93-O93)+O105","v":26333.066666666669},{"$f":"(Q106-Q104)/(A106-A104)*(A105-A104)+Q104","v":-3666.4000000000015}]
[16,null,4000,{"$f":"(E106-C106)/(E93-C93)*(D93-C93)+C106","v":2333.3333333333335},6500,{"$f":"(G106-E106)/(G93-E93)*(F93-E93)+E106","v":4000},9000,{"$f":"(I106-G106)/(I93-G93)*(H93-G93)+G106","v":3000},12000,{"$f":"(K106-I106)/(K93-I93)*(J93-I93)+I106","v":9000},13000,{"$f":"(M106-K106)/(M93-K93)*(L93-K93)+K106","v":7000},16000,{"$f":"(O106-M106)/(O93-M93)*(N93-M93)+M106","v":7000},22000,{"$f":"(Q106-O106)/(Q93-O93)*(P93-O93)+O106","v":13000},31000]
[]
["COL",null,3,4,5,6,7,8,9,10,11,12,13,14,15,16,17]
[]
[]
[null,"DP",10,{"$f":"IF(AND(V118>C111,V118<E111)=TRUE,V118,0)","v":0},25,{"$f":"IF(AND(V118>E111,V118<G111)=TRUE,V118,0)","v":0},50,{"$f":"IF(AND(V118>G111,V118<I111)=TRUE,V118,0)","v":0},75,{"$f":"IF(AND(V118>I111,V118<K111)=TRUE,V118,0)","v":0},100,{"$f":"IF(AND(V118>K111,V118<M111)=TRUE,V118,0)","v":0},150,{"$f":"IF(AND(V118>M111,V118<O111)=TRUE,V118,0)","v":0},250,{"$f":"IF(AND(V118>O111,V118<Q111)=TRUE,V118,0)","v":0},500]
["PM"]
[]
[0.5,null,1900,{"$f":"(E114-C114)/(E111-C111)*(D111-C111)+C114","v":1300},2800,{"$f":"(G114-E114)/(G111-E111)*(F111-E111)+E114","v":2100},3500,{"$f":"(I114-G114)/(I111-G111)*(H111-G111)+G114","v":3499.8},3500.1,{"$f":"(K114-I114)/(K111-I111)*(J111-I111)+I114","v":3499.8},3500.2,{"$f":"(M114-K114)/(M111-K111)*(L111-K111)+K114","v":3499.9999999999991},3500.3,{"$f":"(O114-M114)/(O111-M111)*(N111-M111)+M114","v":3500.1500000000005},3500.4,{"$f":"(Q114-O114)/(Q111-O111)*(P111-O111)+O114","v":3500.3100000000004},3500.49,null,"PM","Q","Qcal","DPcal","DP","TIPO"]
[{"$f":"IF(AND(S118>A114,S118<A116)=TRUE,S118,0)","v":0},null,{"$f":"(C116-C114)/(A116-A114)*(A115-A114)+C114","v":1600},{"$f":"(E115-C115)/(E111-C111)*(D111-C111)+C115","v":1266.6666666666665},{"$f":"(E116-E114)/(A116-A114)*(A115-A114)+E114","v":2100},{"$f":"(G115-E115)/(G111-E111)*(F111-E111)+E115","v":1200},{"$f":"(G116-G114)/(A116-A114)*(A115-A114)+G114","v":3000},{"$f":"(I115-G115)/(I111-G111)*(H111-G111)+G115","v":2999.8},{"$f":"(I116-I114)/(A116-A114)*(A115-A114)+I114","v":3000.1},{"$f":"(K115-I115)/(K111-I111)*(J111-I111)+I115","v":2999.8},{"$f":"(K116-K114)/(A116-A114)*(A115-A114)+K114","v":3000.2},{"$f":"(M115-K115)/(M111-K111)*(L111-K111)+K115","v":2999.9999999999991},{"$f":"(M116-M114)/(A116-A114)*(A115-A114)+M114","v":3000.3},{"$f":"(O115-M115)/(O111-M111)*(N111-M111)+M115","v":3000.1500000000005},{"$f":"(O116-O114)/(A116-A114)*(A115-A114)+O114","v":3000.4},{"$f":"(Q115-O115)/(Q111-O111)*(P111-O111)+O115","v":3000.3100000000004},{"$f":"(Q116-Q114)/(A116-A114)*(A115-A114)+Q114","v":3000.49}]
[1,null,2200,{"$f":"(E116-C116)/(E111-C111)*(D111-C111)+C116","v":1333.3333333333333},3500,{"$f":"(G116-E116)/(G111-E111)*(F111-E111)+E116","v":3000},4000,{"$f":"(I116-G116)/(I111-G111)*(H111-G111)+G116","v":3999.8},4000.1,{"$f":"(K116-I116)/(K111-I111)*(J111-I111)+I116","v":3999.8},4000.2,{"$f":"(M116-K116)/(M111-K111)*(L111-K111)+K116","v":3999.9999999999991},4000.3,{"$f":"(O116-M116)/(O111-M111)*(N111-M111)+M116","v":4000.1500000000005},4000.4,{"$f":"(Q116-O116)/(Q111-O111)*(P111-O111)+O116","v":4000.3100000000004},4000.49,null,null,"нм3/час","нм3/час","мбар","мбар"]
[{"$f":"IF(AND(S118>A116,S118<A118)=TRUE,S118,0)","v":0},null,{"$f":"(C118-C116)/(A118-A116)*(A117-A116)+C116","v":1650},{"$f":"(E117-C117)/(E111-C111)*(D111-C111)+C117","v":916.66666666666674},{"$f":"(E118-E116)/(A118-A116)*(A117-A116)+E116","v":2750},{"$f":"(G117-E117)/(G111-E111)*(F111-E111)+E117","v":3500},{"$f":"(G118-G116)/(A118-A116)*(A117-A116)+G116","v":2000},{"$f":"(I117-G117)/(I111-G111)*(H111-G111)+G117","v":1999.8000000000011},{"$f":"(I118-I116)/(A118-A116)*(A117-A116)+I116","v":2000.0999999999995},{"$f":"(K117-I117)/(K111-I111)*(J111-I111)+I117","v":1999.7999999999984},{"$f":"(K118-K116)/(A118-A116)*(A117-A116)+K116","v":2000.1999999999998},{"$f":"(M117-K117)/(M111-K111)*(L111-K111)+K117","v":1999.9999999999991},{"$f":"(M118-M116)/(A118-A116)*(A117-A116)+M116","v":2000.3000000000002},{"$f":"(O117-M117)/(O111-M111)*(N111-M111)+M117","v":2000.1499999999996},{"$f":"(O118-O116)/(A118-A116)*(A117-A116)+O116","v":2000.4000000000005},{"$f":"(Q117-O117)/(Q111-O111)*(P111-O111)+O117","v":2000.3100000000013},{"$f":"(Q118-Q116)/(A118-A116)*(A117-A116)+Q116","v":2000.4899999999998}]
[2,null,2750,{"$f":"(E118-C118)/(E111-C111)*(D111-C111)+C118","v":1750},4250,{"$f":"(G118-E118)/(G111-E111)*(F111-E111)+E118","v":2500},6000,{"$f":"(I118-G118)/(I111-G111)*(H111-G111)+G118","v":5999.7999999999993},6000.1,{"$f":"(K118-I118)/(K111-I111)*(J111-I111)+I118","v":5999.800000000002},6000.2,{"$f":"(M118-K118)/(M111-K111)*(L111-K111)+K118","v":5999.9999999999991},6000.3,{"$f":"(O118-M118)/(O111-M111)*(N111-M111)+M118","v":6000.1500000000015},6000.4,{"$f":"(Q118-O118)/(Q111-O111)*(P111-O111)+O118","v":6000.3099999999995},6000.49,null,{"$f":"Лист1!B17*10","v":0.1},{"$f":"Лист1!B19","v":3500},{"$f":"VLOOKUP(S118,A111:Q126,HLOOKUP(V118,A111:Q126,16,0),0)","v":{"$error":"#N/A"}},{"$f":"Лист1!B18*10","v":100},{"$f":"IF(S118<A114,\"NO\",IF(S118>A124,\"N0\",IF(VLOOKUP(S118,A114:Q124,3,0)>T118,\"NO\",IF(VLOOKUP(S118,A114:Q124,17,0)<T118,\"NO\",IF(AND(U118>=T118-0.1,U118<T118+0.1)=TRUE,V118,\"NO\")))))","v":"NO"},"Фильтр газовый",{"$f":"Лист1!F13","v":"РЕД-С-3,5-1-150 DN150"}]
[{"$f":"IF(AND(S118>A118,S118<A120)=TRUE,S118,0)","v":0},null,{"$f":"(C120-C118)/(A120-A118)*(A119-A118)+C118","v":1916.6666666666665},{"$f":"(E119-C119)/(E111-C111)*(D111-C111)+C119","v":1138.8888888888887},{"$f":"(E120-E118)/(A120-A118)*(A119-A118)+E118","v":3083.333333333333},{"$f":"(G119-E119)/(G111-E111)*(F111-E111)+E119","v":2166.6666666666661},{"$f":"(G120-G118)/(A120-A118)*(A119-A118)+G118","v":4000},{"$f":"(I119-G119)/(I111-G111)*(H111-G111)+G119","v":5332.9999999999991},{"$f":"(I120-I118)/(A120-A118)*(A119-A118)+I118","v":3333.5000000000005},{"$f":"(K119-I119)/(K111-I111)*(J111-I111)+I119","v":6333.0000000000027},{"$f":"(K120-K118)/(A120-A118)*(A119-A118)+K118","v":2333.6666666666665},{"$f":"(M119-K119)/(M111-K111)*(L111-K111)+K119","v":2999.9999999999986},{"$f":"(M120-M118)/(A120-A118)*(A119-A118)+M118","v":2000.5000000000005},{"$f":"(O119-M119)/(O111-M111)*(N111-M111)+M119","v":2000.3500000000026},{"$f":"(O120-O118)/(A120-A118)*(A119-A118)+O118","v":2000.599999999999},{"$f":"(Q119-O119)/(Q111-O111)*(P111-O111)+O119","v":2000.5166666666655},{"$f":"(Q120-Q118)/(A120-A118)*(A119-A118)+Q118","v":2000.6833333333325}]
[5,null,4000,{"$f":"(E120-C120)/(E111-C111)*(D111-C111)+C120","v":2666.6666666666665},6000,{"$f":"(G120-E120)/(G111-E111)*(F111-E111)+E120","v":3000},9000,{"$f":"(I120-G120)/(I111-G111)*(H111-G111)+G120","v":7000},10000,{"$f":"(K120-I120)/(K111-I111)*(J111-I111)+I120","v":5500},11500,{"$f":"(M120-K120)/(M111-K111)*(L111-K111)+K120","v":10500},12000,{"$f":"(O120-M120)/(O111-M111)*(N111-M111)+M120","v":11999.849999999999},12000.1,{"$f":"(Q120-O120)/(Q111-O111)*(P111-O111)+O120","v":12000},12000.2]
[{"$f":"IF(AND(S118>A120,S118<A122)=TRUE,S118,0)","v":0},null,{"$f":"(C122-C120)/(A122-A120)*(A121-A120)+C120","v":2500},{"$f":"(E121-C121)/(E111-C111)*(D111-C111)+C121","v":1500},{"$f":"(E122-E120)/(A122-A120)*(A121-A120)+E120","v":4000},{"$f":"(G121-E121)/(G111-E111)*(F111-E111)+E121","v":3000},{"$f":"(G122-G120)/(A122-A120)*(A121-A120)+G120","v":5000},{"$f":"(I121-G121)/(I111-G111)*(H111-G111)+G121","v":5000},{"$f":"(I122-I120)/(A122-A120)*(A121-A120)+I120","v":5000},{"$f":"(K121-I121)/(K111-I111)*(J111-I111)+I121","v":2000},{"$f":"(K122-K120)/(A122-A120)*(A121-A120)+K120","v":6000},{"$f":"(M121-K121)/(M111-K111)*(L111-K111)+K121","v":10000},{"$f":"(M122-M120)/(A122-A120)*(A121-A120)+M120","v":4000},{"$f":"(O121-M121)/(O111-M111)*(N111-M111)+M121","v":6999.6999999999989},{"$f":"(O122-O120)/(A122-A120)*(A121-A120)+O120","v":2000.2000000000007},{"$f":"(Q121-O121)/(Q111-O111)*(P111-O111)+O121","v":2000.0999999999985},{"$f":"(Q122-Q120)/(A122-A120)*(A121-A120)+Q120","v":2000.3000000000029}]
[10,null,5500,{"$f":"(E122-C122)/(E111-C111)*(D111-C111)+C122","v":3833.3333333333335},8000,{"$f":"(G122-E122)/(G111-E111)*(F111-E111)+E122","v":3000},13000,{"$f":"(I122-G122)/(I111-G111)*(H111-G111)+G122","v":9000},15000,{"$f":"(K122-I122)/(K111-I111)*(J111-I111)+I122","v":9000},17000,{"$f":"(M122-K122)/(M111-K111)*(L111-K111)+K122","v":11000},20000,{"$f":"(O122-M122)/(O111-M111)*(N111-M111)+M122","v":17000},22000,{"$f":"(Q122-O122)/(Q111-O111)*(P111-O111)+O122","v":21999.9},22000.1]
[{"$f":"IF(AND(S118>A122,S118<A124)=TRUE,S118,0)","v":0},null,{"$f":"(C124-C122)/(A124-A122)*(A123-A122)+C122","v":3833.3333333333335},{"$f":"(E123-C123)/(E111-C111)*(D111-C111)+C123","v":3277.7777777777778},{"$f":"(E124-E122)/(A124-A122)*(A123-A122)+E122","v":4666.666666666667},{"$f":"(G123-E123)/(G111-E111)*(F111-E111)+E123","v":-333.33333333333394},{"$f":"(G124-G122)/(A124-A122)*(A123-A122)+G122","v":9666.6666666666679},{"$f":"(I123-G123)/(I111-G111)*(H111-G111)+G123","v":9000.0000000000036},{"$f":"(I124-I122)/(A124-A122)*(A123-A122)+I122","v":10000},{"$f":"(K123-I123)/(K111-I111)*(J111-I111)+I123","v":14000.000000000002},{"$f":"(K124-K122)/(A124-A122)*(A123-A122)+K122","v":8666.6666666666661},{"$f":"(M123-K123)/(M111-K111)*(L111-K111)+K123","v":5999.9999999999982},{"$f":"(M124-M122)/(A124-A122)*(A123-A122)+M122","v":10000},{"$f":"(O123-M123)/(O111-M111)*(N111-M111)+M123","v":14500},{"$f":"(O124-O122)/(A124-A122)*(A123-A122)+O122","v":7000},{"$f":"(Q123-O123)/(Q111-O111)*(P111-O111)+O123","v":6999.9000000000015},{"$f":"(Q124-Q122)/(A124-A122)*(A123-A122)+Q122","v":7000.0999999999985}]
[16,null,6500,{"$f":"(E124-C124)/(E111-C111)*(D111-C111)+C124","v":4166.6666666666661},10000,{"$f":"(G124-E124)/(G111-E111)*(F111-E111)+E124","v":5000},15000,{"$f":"(I124-G124)/(I111-G111)*(H111-G111)+G124","v":9000},18000,{"$f":"(K124-I124)/(K111-I111)*(J111-I111)+I124","v":6000},22000,{"$f":"(M124-K124)/(M111-K111)*(L111-K111)+K124","v":14000},26000,{"$f":"(O124-M124)/(O111-M111)*(N111-M111)+M124","v":18500},31000,{"$f":"(Q124-O124)/(Q111-O111)*(P111-O111)+O124","v":30999.9},31000.1]
[]
["COL",null,3,4,5,6,7,8,9,10,11,12,13,14,15,16,17]
[]
[]
[null,"DP",10,{"$f":"IF(AND(V136>C129,V136<E129)=TRUE,V136,0)","v":0},25,{"$f":"IF(AND(V136>E129,V136<G129)=TRUE,V136,0)","v":0},50,{"$f":"IF(AND(V136>G129,V136<I129)=TRUE,V136,0)","v":0},75,{"$f":"IF(AND(V136>I129,V136<K129)=TRUE,V136,0)","v":0},100,{"$f":"IF(AND(V136>K129,V136<M129)=TRUE,V136,0)","v":0},150,{"$f":"IF(AND(V136>M129,V136<O129)=TRUE,V136,0)","v":0},250,{"$f":"IF(AND(V136>O129,V136<Q129)=TRUE,V136,0)","v":0},500]
["PM"]
[]
[0.5,null,2250,{"$f":"(E132-C132)/(E129-C129)*(D129-C129)+C132","v":1483.3333333333333},3400,{"$f":"(G132-E132)/(G129-E129)*(F129-E129)+E132","v":1800},5000,{"$f":"(I132-G132)/(I129-G129)*(H129-G129)+G132","v":4999.7999999999993},5000.1000000000004,{"$f":"(K132-I132)/(K129-I129)*(J129-I129)+I132","v":4999.800000000002},5000.2,{"$f":"(M132-K132)/(M129-K129)*(L129-K129)+K132","v":4999.9999999999991},5000.3,{"$f":"(O132-M132)/(O129-M129)*(N129-M129)+M132","v":5000.1500000000015},5000.3999999999996,{"$f":"(Q132-O132)/(Q129-O129)*(P129-O129)+O132","v":5000.3099999999995},5000.49,null,"PM","Q","Qcal","DPcal","DP","TIPO"]
[{"$f":"IF(AND(S136>A132,S136<A134)=TRUE,S136,0)","v":0},null,{"$f":"(C134-C132)/(A134-A132)*(A133-A132)+C132","v":2000},{"$f":"(E133-C133)/(E129-C129)*(D129-C129)+C133","v":1466.6666666666665},{"$f":"(E134-E132)/(A134-A132)*(A133-A132)+E132","v":2800},{"$f":"(G133-E133)/(G129-E129)*(F129-E129)+E133","v":1100},{"$f":"(G134-G132)/(A134-A132)*(A133-A132)+G132","v":4500},{"$f":"(I133-G133)/(I129-G129)*(H129-G129)+G133","v":7499.5999999999985},{"$f":"(I134-I132)/(A134-A132)*(A133-A132)+I132","v":3000.2000000000007},{"$f":"(K133-I133)/(K129-I129)*(J129-I129)+I133","v":2999.9000000000051},{"$f":"(K134-K132)/(A134-A132)*(A133-A132)+K132","v":3000.2999999999993},{"$f":"(M133-K133)/(M129-K129)*(L129-K129)+K133","v":3000.0999999999967},{"$f":"(M134-M132)/(A134-A132)*(A133-A132)+M132","v":3000.4000000000005},{"$f":"(O133-M133)/(O129-M129)*(N129-M129)+M133","v":3000.2500000000027},{"$f":"(O134-O132)/(A134-A132)*(A133-A132)+O132","v":3000.4999999999991},{"$f":"(Q133-O133)/(Q129-O129)*(P129-O129)+O133","v":3000.4199999999983},{"$f":"(Q134-Q132)/(A134-A132)*(A133-A132)+Q132","v":3000.58}]
[1,null,2500,{"$f":"(E134-C134)/(E129-C129)*(D129-C129)+C134","v":1500},4000,{"$f":"(G134-E134)/(G129-E129)*(F129-E129)+E134","v":2500},5500,{"$f":"(I134-G134)/(I129-G129)*(H129-G129)+G134","v":2500},7000,{"$f":"(K134-I134)/(K129-I129)*(J129-I129)+I134","v":6999.6999999999989},7000.1,{"$f":"(M134-K134)/(M129-K129)*(L129-K129)+K134","v":6999.9000000000015},7000.2,{"$f":"(O134-M134)/(O129-M129)*(N129-M129)+M134","v":7000.0499999999993},7000.3,{"$f":"(Q134-O134)/(Q129-O129)*(P129-O129)+O134","v":7000.2000000000007},7000.4,null,null,"нм3/час","нм3/час","мбар","мбар"]
[{"$f":"IF(AND(S136>A134,S136<A136)=TRUE,S136,0)","v":0},null,{"$f":"(C136-C134)/(A136-A134)*(A135-A134)+C134","v":2000},{"$f":"(E135-C135)/(E129-C129)*(D129-C129)+C135","v":1333.3333333333333},{"$f":"(E136-E134)/(A136-A134)*(A135-A134)+E134","v":3000},{"$f":"(G135-E135)/(G129-E129)*(F129-E129)+E135","v":2000},{"$f":"(G136-G134)/(A136-A134)*(A135-A134)+G134","v":4000},{"$f":"(I135-G135)/(I129-G129)*(H129-G129)+G135","v":2000},{"$f":"(I136-I134)/(A136-A134)*(A135-A134)+I134","v":5000},{"$f":"(K135-I135)/(K129-I129)*(J129-I129)+I135","v":7999.3999999999978},{"$f":"(K136-K134)/(A136-A134)*(A135-A134)+K134","v":4000.2000000000007},{"$f":"(M135-K135)/(M129-K129)*(L129-K129)+K135","v":4000.0000000000036},{"$f":"(M136-M134)/(A136-A134)*(A135-A134)+M134","v":4000.2999999999993},{"$f":"(O135-M135)/(O129-M129)*(N129-M129)+M135","v":4000.1499999999987},{"$f":"(O136-O134)/(A136-A134)*(A135-A134)+O134","v":4000.3999999999996},{"$f":"(Q135-O135)/(Q129-O129)*(P129-O129)+O135","v":4000.2999999999993},{"$f":"(Q136-Q134)/(A136-A134)*(A135-A134)+Q134","v":4000.5}]
[2,null,3000,{"$f":"(E136-C136)/(E129-C129)*(D129-C129)+C136","v":1666.6666666666665},5000,{"$f":"(G136-E136)/(G129-E129)*(F129-E129)+E136","v":3000},7000,{"$f":"(I136-G136)/(I129-G129)*(H129-G129)+G136","v":3000},9000,{"$f":"(K136-I136)/(K129-I129)*(J129-I129)+I136","v":6000},10000,{"$f":"(M136-K136)/(M129-K129)*(L129-K129)+K136","v":9999.7999999999993},10000.1,{"$f":"(O136-M136)/(O129-M129)*(N129-M129)+M136","v":9999.9500000000007},10000.200000000001,{"$f":"(Q136-O136)/(Q129-O129)*(P129-O129)+O136","v":10000.100000000002},10000.299999999999,null,{"$f":"Лист1!B17*10","v":0.1},{"$f":"Лист1!B19","v":3500},{"$f":"VLOOKUP(S136,A129:Q144,HLOOKUP(V136,A129:Q144,16,0),0)","v":{"$error":"#N/A"}},{"$f":"Лист1!B18*10","v":100},{"$f":"IF(S136<A132,\"NO\",IF(S136>A142,\"N0\",IF(VLOOKUP(S136,A132:Q142,3,0)>T136,\"NO\",IF(VLOOKUP(S136,A132:Q142,17,0)<T136,\"NO\",IF(AND(U136>=T136-0.1,U136<T136+0.1)=TRUE,V136,\"NO\")))))","v":"NO"},"Фильтр газовый",{"$f":"Лист1!F14","v":"РЕД-С-4-1-200 DN200"}]
[{"$f":"IF(AND(S136>A136,S136<A138)=TRUE,S136,0)","v":0},null,{"$f":"(C138-C136)/(A138-A136)*(A137-A136)+C136","v":2000},{"$f":"(E137-C137)/(E129-C129)*(D129-C129)+C137","v":888.88888888888869},{"$f":"(E138-E136)/(A138-A136)*(A137-A136)+E136","v":3666.666666666667},{"$f":"(G137-E137)/(G129-E129)*(F129-E129)+E137","v":2333.3333333333339},{"$f":"(G138-G136)/(A138-A136)*(A137-A136)+G136","v":5000},{"$f":"(I137-G137)/(I129-G129)*(H129-G129)+G137","v":1666.6666666666679},{"$f":"(I138-I136)/(A138-A136)*(A137-A136)+I136","v":6666.6666666666661},{"$f":"(K137-I137)/(K129-I129)*(J129-I129)+I137","v":6666.6666666666661},{"$f":"(K138-K136)/(A138-A136)*(A137-A136)+K136","v":6666.6666666666661},{"$f":"(M137-K137)/(M129-K129)*(L129-K129)+K137","v":9999.6666666666642},{"$f":"(M138-M136)/(A138-A136)*(A137-A136)+M136","v":5000.166666666667},{"$f":"(O137-M137)/(O129-M129)*(N129-M129)+M137","v":5000.0166666666637},{"$f":"(O138-O136)/(A138-A136)*(A137-A136)+O136","v":5000.2666666666692},{"$f":"(Q137-O137)/(Q129-O129)*(P129-O129)+O137","v":5000.1666666666733},{"$f":"(Q138-Q136)/(A138-A136)*(A137-A136)+Q136","v":5000.366666666665}]
[5,null,4500,{"$f":"(E138-C138)/(E129-C129)*(D129-C129)+C138","v":2833.3333333333335},7000,{"$f":"(G138-E138)/(G129-E129)*(F129-E129)+E138","v":4000},10000,{"$f":"(I138-G138)/(I129-G129)*(H129-G129)+G138","v":5000},12500,{"$f":"(K138-I138)/(K129-I129)*(J129-I129)+I138","v":5000},15000,{"$f":"(M138-K138)/(M129-K129)*(L129-K129)+K138","v":10000},17500,{"$f":"(O138-M138)/(O129-M129)*(N129-M129)+M138","v":17499.850000000002},17500.099999999999,{"$f":"(Q138-O138)/(Q129-O129)*(P129-O129)+O138","v":17499.999999999996},17500.2]
[{"$f":"IF(AND(S136>A138,S136<A140)=TRUE,S136,0)","v":0},null,{"$f":"(C140-C138)/(A140-A138)*(A139-A138)+C138","v":2500},{"$f":"(E139-C139)/(E129-C129)*(D129-C129)+C139","v":1500},{"$f":"(E140-E138)/(A140-A138)*(A139-A138)+E138","v":4000},{"$f":"(G139-E139)/(G129-E129)*(F129-E129)+E139","v":3000},{"$f":"(G140-G138)/(A140-A138)*(A139-A138)+G138","v":5000},{"$f":"(I139-G139)/(I129-G129)*(H129-G129)+G139","v":1000},{"$f":"(I140-I138)/(A140-A138)*(A139-A138)+I138","v":7000},{"$f":"(K139-I139)/(K129-I129)*(J129-I129)+I139","v":-3500},{"$f":"(K140-K138)/(A140-A138)*(A139-A138)+K138","v":10500},{"$f":"(M139-K139)/(M129-K129)*(L129-K129)+K139","v":5500},{"$f":"(M140-M138)/(A140-A138)*(A139-A138)+M138","v":13000},{"$f":"(O139-M139)/(O129-M129)*(N129-M129)+M139","v":24999.700000000004},{"$f":"(O140-O138)/(A140-A138)*(A139-A138)+O138","v":5000.1999999999971},{"$f":"(Q139-O139)/(Q129-O129)*(P129-O129)+O139","v":5000.0999999999913},{"$f":"(Q140-Q138)/(A140-A138)*(A139-A138)+Q138","v":5000.3000000000029}]
[10,null,6500,{"$f":"(E140-C140)/(E129-C129)*(D129-C129)+C140","v":4166.6666666666661},10000,{"$f":"(G140-E140)/(G129-E129)*(F129-E129)+E140","v":5000},15000,{"$f":"(I140-G140)/(I129-G129)*(H129-G129)+G140","v":9000},18000,{"$f":"(K140-I140)/(K129-I129)*(J129-I129)+I140","v":13500},19500,{"$f":"(M140-K140)/(M129-K129)*(L129-K129)+K140","v":14500},22000,{"$f":"(O140-M140)/(O129-M129)*(N129-M129)+M140","v":10000},30000,{"$f":"(Q140-O140)/(Q129-O129)*(P129-O129)+O140","v":29999.9},30000.1]
[{"$f":"IF(AND(S136>A140,S136<A142)=TRUE,S136,0)","v":0},null,{"$f":"(C142-C140)/(A142-A140)*(A141-A140)+C140","v":4000},{"$f":"(E141-C141)/(E129-C129)*(D129-C129)+C141","v":2222.2222222222217},{"$f":"(E142-E140)/(A142-A140)*(A141-A140)+E140","v":6666.666666666667},{"$f":"(G141-E141)/(G129-E129)*(F129-E129)+E141","v":3333.3333333333339},{"$f":"(G142-G140)/(A142-A140)*(A141-A140)+G140","v":10000},{"$f":"(I141-G141)/(I129-G129)*(H129-G129)+G141","v":7333.3333333333321},{"$f":"(I142-I140)/(A142-A140)*(A141-A140)+I140","v":11333.333333333334},{"$f":"(K141-I141)/(K129-I129)*(J129-I129)+I141","v":14333.333333333334},{"$f":"(K142-K140)/(A142-A140)*(A141-A140)+K140","v":10333.333333333334},{"$f":"(M141-K141)/(M129-K129)*(L129-K129)+K141","v":17000.000000000004},{"$f":"(M142-M140)/(A142-A140)*(A141-A140)+M140","v":7000},{"$f":"(O141-M141)/(O129-M129)*(N129-M129)+M141","v":-14999.999999999993},{"$f":"(O142-O140)/(A142-A140)*(A141-A140)+O140","v":21666.666666666664},{"$f":"(Q141-O141)/(Q129-O129)*(P129-O129)+O141","v":46666.400000000001},{"$f":"(Q142-Q140)/(A142-A140)*(A141-A140)+Q140","v":-3333.066666666673}]
[16,null,8000,{"$f":"(E142-C142)/(E129-C129)*(D129-C129)+C142","v":5333.333333333333},12000,{"$f":"(G142-E142)/(G129-E129)*(F129-E129)+E142","v":6000},18000,{"$f":"(I142-G142)/(I129-G129)*(H129-G129)+G142","v":10000},22000,{"$f":"(K142-I142)/(K129-I129)*(J129-I129)+I142","v":13000},25000,{"$f":"(M142-K142)/(M129-K129)*(L129-K129)+K142","v":13000},31000,{"$f":"(O142-M142)/(O129-M129)*(N129-M129)+M142","v":25000},35000,{"$f":"(Q142-O142)/(Q129-O129)*(P129-O129)+O142","v":20000},50000]
[]
["COL",null,3,4,5,6,7,8,9,10,11,12,13,14,15,16,17]
[]
[]
[null,"DP",10,{"$f":"IF(AND(V154>C147,V154<E147)=TRUE,V154,0)","v":0},25,{"$f":"IF(AND(V154>E147,V154<G147)=TRUE,V154,0)","v":0},50,{"$f":"IF(AND(V154>G147,V154<I147)=TRUE,V154,0)","v":0},75,{"$f":"IF(AND(V154>I147,V154<K147)=TRUE,V154,0)","v":0},100,{"$f":"IF(AND(V154>K147,V154<M147)=TRUE,V154,0)","v":0},150,{"$f":"IF(AND(V154>M147,V154<O147)=TRUE,V154,0)","v":0},250,{"$f":"IF(AND(V154>O147,V154<Q147)=TRUE,V154,0)","v":0},500]
["PM"]
[]
[0.5,null,3500,{"$f":"(E150-C150)/(E147-C147)*(D147-C147)+C150","v":2166.6666666666665},5500,{"$f":"(G150-E150)/(G147-E147)*(F147-E147)+E150","v":3000},8000,{"$f":"(I150-G150)/(I147-G147)*(H147-G147)+G150","v":7999.7999999999993},8000.1,{"$f":"(K150-I150)/(K147-I147)*(J147-I147)+I150","v":7999.800000000002},8000.2,{"$f":"(M150-K150)/(M147-K147)*(L147-K147)+K150","v":7999.9999999999991},8000.3,{"$f":"(O150-M150)/(O147-M147)*(N147-M147)+M150","v":8000.1500000000015},8000.4,{"$f":"(Q150-O150)/(Q147-O147)*(P147-O147)+O150","v":8000.3099999999995},8000.49,null,"PM","Q","Qcal","DPcal","DP","TIPO"]
[{"$f":"IF(AND(S154>A150,S154<A152)=TRUE,S154,0)","v":0},null,{"$f":"(C152-C150)/(A152-A150)*(A151-A150)+C150","v":3250},{"$f":"(E151-C151)/(E147-C147)*(D147-C147)+C151","v":2750},{"$f":"(E152-E150)/(A152-A150)*(A151-A150)+E150","v":4000},{"$f":"(G151-E151)/(G147-E147)*(F147-E147)+E151","v":3000},{"$f":"(G152-G150)/(A152-A150)*(A151-A150)+G150","v":5000},{"$f":"(I151-G151)/(I147-G147)*(H147-G147)+G151","v":4999.7999999999993},{"$f":"(I152-I150)/(A152-A150)*(A151-A150)+I150","v":5000.1000000000004},{"$f":"(K151-I151)/(K147-I147)*(J147-I147)+I151","v":4999.8000000000047},{"$f":"(K152-K150)/(A152-A150)*(A151-A150)+K150","v":5000.1999999999989},{"$f":"(M151-K151)/(M147-K147)*(L147-K147)+K151","v":4999.9999999999945},{"$f":"(M152-M150)/(A152-A150)*(A151-A150)+M150","v":5000.3000000000011},{"$f":"(O151-M151)/(O147-M147)*(N147-M147)+M151","v":5000.1500000000033},{"$f":"(O152-O150)/(A152-A150)*(A151-A150)+O150","v":5000.3999999999996},{"$f":"(Q151-O151)/(Q147-O147)*(P147-O147)+O151","v":5000.3099999999995},{"$f":"(Q152-Q150)/(A152-A150)*(A151-A150)+Q150","v":5000.49}]
[1,null,3750,{"$f":"(E152-C152)/(E147-C147)*(D147-C147)+C152","v":1583.3333333333335},7000,{"$f":"(G152-E152)/(G147-E147)*(F147-E147)+E152","v":3000},11000,{"$f":"(I152-G152)/(I147-G147)*(H147-G147)+G152","v":10999.8},11000.1,{"$f":"(K152-I152)/(K147-I147)*(J147-I147)+I152","v":10999.8},11000.2,{"$f":"(M152-K152)/(M147-K147)*(L147-K147)+K152","v":11000.000000000004},11000.3,{"$f":"(O152-M152)/(O147-M147)*(N147-M147)+M152","v":11000.149999999998},11000.4,{"$f":"(Q152-O152)/(Q147-O147)*(P147-O147)+O152","v":11000.31},11000.49,null,null,"нм3/час","нм3/час","мбар","мбар"]
[{"$f":"IF(AND(S154>A152,S154<A154)=TRUE,S154,0)","v":0},null,{"$f":"(C154-C152)/(A154-A152)*(A153-A152)+C152","v":1000},{"$f":"(E153-C153)/(E147-C147)*(D147-C147)+C153","v":-2000},{"$f":"(E154-E152)/(A154-A152)*(A153-A152)+E152","v":5500},{"$f":"(G153-E153)/(G147-E147)*(F147-E147)+E153","v":1500},{"$f":"(G154-G152)/(A154-A152)*(A153-A152)+G152","v":9500},{"$f":"(I153-G153)/(I147-G147)*(H147-G147)+G153","v":16499.599999999999},{"$f":"(I154-I152)/(A154-A152)*(A153-A152)+I152","v":6000.2000000000007},{"$f":"(K153-I153)/(K147-I147)*(J147-I147)+I153","v":5999.9},{"$f":"(K154-K152)/(A154-A152)*(A153-A152)+K152","v":6000.3000000000011},{"$f":"(M153-K153)/(M147-K147)*(L147-K147)+K153","v":6000.1000000000076},{"$f":"(M154-M152)/(A154-A152)*(A153-A152)+M152","v":6000.3999999999978},{"$f":"(O153-M153)/(O147-M147)*(N147-M147)+M153","v":6000.2499999999945},{"$f":"(O154-O152)/(A154-A152)*(A153-A152)+O152","v":6000.5},{"$f":"(Q153-O153)/(Q147-O147)*(P147-O147)+O153","v":6000.42},{"$f":"(Q154-Q152)/(A154-A152)*(A153-A152)+Q152","v":6000.58}]
[2,null,6500,{"$f":"(E154-C154)/(E147-C147)*(D147-C147)+C154","v":5166.6666666666661},8500,{"$f":"(G154-E154)/(G147-E147)*(F147-E147)+E154","v":4500},12500,{"$f":"(I154-G154)/(I147-G147)*(H147-G147)+G154","v":5500},16000,{"$f":"(K154-I154)/(K147-I147)*(J147-I147)+I154","v":15999.699999999999},16000.1,{"$f":"(M154-K154)/(M147-K147)*(L147-K147)+K154","v":15999.9},16000.2,{"$f":"(O154-M154)/(O147-M147)*(N147-M147)+M154","v":16000.050000000003},16000.3,{"$f":"(Q154-O154)/(Q147-O147)*(P147-O147)+O154","v":16000.199999999999},16000.4,null,{"$f":"Лист1!B17*10","v":0.1},{"$f":"Лист1!B19","v":3500},{"$f":"VLOOKUP(S154,A147:Q162,HLOOKUP(V154,A147:Q162,16,0),0)","v":{"$error":"#N/A"}},{"$f":"Лист1!B18*10","v":100},{"$f":"IF(S154<A150,\"NO\",IF(S154>A160,\"N0\",IF(VLOOKUP(S154,A150:Q160,3,0)>T154,\"NO\",IF(VLOOKUP(S154,A150:Q160,17,0)<T154,\"NO\",IF(AND(U154>=T154-0.1,U154<T154+0.1)=TRUE,V154,\"NO\")))))","v":"NO"},"Фильтр газовый",{"$f":"Лист1!F15","v":"РЕД-С-5-1-250 DN250"}]
[{"$f":"IF(AND(S154>A154,S154<A156)=TRUE,S154,0)","v":0},null,{"$f":"(C156-C154)/(A156-A154)*(A155-A154)+C154","v":5166.666666666667},{"$f":"(E155-C155)/(E147-C147)*(D147-C147)+C155","v":4944.4444444444453},{"$f":"(E156-E154)/(A156-A154)*(A155-A154)+E154","v":5500},{"$f":"(G155-E155)/(G147-E147)*(F147-E147)+E155","v":1833.3333333333344},{"$f":"(G156-G154)/(A156-A154)*(A155-A154)+G154","v":9166.6666666666661},{"$f":"(I155-G155)/(I147-G147)*(H147-G147)+G155","v":2166.6666666666661},{"$f":"(I156-I154)/(A156-A154)*(A155-A154)+I154","v":12666.666666666666},{"$f":"(K155-I155)/(K147-I147)*(J147-I147)+I155","v":22666.166666666664},{"$f":"(K156-K154)/(A156-A154)*(A155-A154)+K154","v":9333.5},{"$f":"(M155-K155)/(M147-K147)*(L147-K147)+K155","v":17333.166666666664},{"$f":"(M156-M154)/(A156-A154)*(A155-A154)+M154","v":5333.6666666666679},{"$f":"(O155-M155)/(O147-M147)*(N147-M147)+M155","v":5333.5166666666701},{"$f":"(O156-O154)/(A156-A154)*(A155-A154)+O154","v":5333.7666666666664},{"$f":"(Q155-O155)/(Q147-O147)*(P147-O147)+O155","v":5333.6666666666679},{"$f":"(Q156-Q154)/(A156-A154)*(A155-A154)+Q154","v":5333.866666666665}]
[5,null,8500,{"$f":"(E156-C156)/(E147-C147)*(D147-C147)+C156","v":5500},13000,{"$f":"(G156-E156)/(G147-E147)*(F147-E147)+E156","v":8500},17500,{"$f":"(I156-G156)/(I147-G147)*(H147-G147)+G156","v":10500},21000,{"$f":"(K156-I156)/(K147-I147)*(J147-I147)+I156","v":6000},26000,{"$f":"(M156-K156)/(M147-K147)*(L147-K147)+K156","v":14000},32000,{"$f":"(O156-M156)/(O147-M147)*(N147-M147)+M156","v":31999.850000000002},32000.1,{"$f":"(Q156-O156)/(Q147-O147)*(P147-O147)+O156","v":31999.999999999996},32000.2]
[{"$f":"IF(AND(S154>A156,S154<A158)=TRUE,S154,0)","v":0},null,{"$f":"(C158-C156)/(A158-A156)*(A157-A156)+C156","v":5000},{"$f":"(E157-C157)/(E147-C147)*(D147-C147)+C157","v":3000},{"$f":"(E158-E156)/(A158-A156)*(A157-A156)+E156","v":8000},{"$f":"(G157-E157)/(G147-E147)*(F147-E147)+E157","v":8000},{"$f":"(G158-G156)/(A158-A156)*(A157-A156)+G156","v":8000},{"$f":"(I157-G157)/(I147-G147)*(H147-G147)+G157","v":4000},{"$f":"(I158-I156)/(A158-A156)*(A157-A156)+I156","v":10000},{"$f":"(K157-I157)/(K147-I147)*(J147-I147)+I157","v":-11000},{"$f":"(K158-K156)/(A158-A156)*(A157-A156)+K156","v":17000},{"$f":"(M157-K157)/(M147-K147)*(L147-K147)+K157","v":3000},{"$f":"(M158-M156)/(A158-A156)*(A157-A156)+M156","v":24000},{"$f":"(O157-M157)/(O147-M147)*(N147-M147)+M157","v":49499.700000000004},{"$f":"(O158-O156)/(A158-A156)*(A157-A156)+O156","v":7000.1999999999971},{"$f":"(Q157-O157)/(Q147-O147)*(P147-O147)+O157","v":7000.0999999999913},{"$f":"(Q158-Q156)/(A158-A156)*(A157-A156)+Q156","v":7000.3000000000029}]
[10,null,12000,{"$f":"(E158-C158)/(E147-C147)*(D147-C147)+C158","v":8000},18000,{"$f":"(G158-E158)/(G147-E147)*(F147-E147)+E158","v":9000},27000,{"$f":"(I158-G158)/(I147-G147)*(H147-G147)+G158","v":17000},32000,{"$f":"(K158-I158)/(K147-I147)*(J147-I147)+I158","v":23000},35000,{"$f":"(M158-K158)/(M147-K147)*(L147-K147)+K158","v":25000},40000,{"$f":"(O158-M158)/(O147-M147)*(N147-M147)+M158","v":14500},57000,{"$f":"(Q158-O158)/(Q147-O147)*(P147-O147)+O158","v":56999.9},57000.1]
[{"$f":"IF(AND(S154>A158,S154<A160)=TRUE,S154,0)","v":0},null,{"$f":"(C160-C158)/(A160-A158)*(A159-A158)+C158","v":8666.6666666666679},{"$f":"(E159-C159)/(E147-C147)*(D147-C147)+C159","v":6888.8888888888905},{"$f":"(E160-E158)/(A160-A158)*(A159-A158)+E158","v":11333.333333333334},{"$f":"(G159-E159)/(G147-E147)*(F147-E147)+E159","v":4000.0000000000036},{"$f":"(G160-G158)/(A160-A158)*(A159-A158)+G158","v":18666.666666666664},{"$f":"(I159-G159)/(I147-G147)*(H147-G147)+G159","v":18666.666666666657},{"$f":"(I160-I158)/(A160-A158)*(A159-A158)+I158","v":18666.666666666668},{"$f":"(K159-I159)/(K147-I147)*(J147-I147)+I159","v":19666.666666666675},{"$f":"(K160-K158)/(A160-A158)*(A159-A158)+K158","v":18333.333333333332},{"$f":"(M159-K159)/(M147-K147)*(L147-K147)+K159","v":24999.999999999996},{"$f":"(M160-M158)/(A160-A158)*(A159-A158)+M158","v":15000},{"$f":"(O159-M159)/(O147-M147)*(N147-M147)+M159","v":-28000.000000000015},{"$f":"(O160-O158)/(A160-A158)*(A159-A158)+O158","v":43666.666666666672},{"$f":"(Q159-O159)/(Q147-O147)*(P147-O147)+O159","v":85333.06666666668},{"$f":"(Q160-Q158)/(A160-A158)*(A159-A158)+Q158","v":2000.2666666666628}]
[16,null,14000,{"$f":"(E160-C160)/(E147-C147)*(D147-C147)+C160","v":8666.6666666666661},22000,{"$f":"(G160-E160)/(G147-E147)*(F147-E147)+E160","v":12000},32000,{"$f":"(I160-G160)/(I147-G147)*(H147-G147)+G160","v":16000},40000,{"$f":"(K160-I160)/(K147-I147)*(J147-I147)+I160","v":25000},45000,{"$f":"(M160-K160)/(M147-K147)*(L147-K147)+K160","v":25000},55000,{"$f":"(O160-M160)/(O147-M147)*(N147-M147)+M160","v":40000},65000,{"$f":"(Q160-O160)/(Q147-O147)*(P147-O147)+O160","v":40000},90000]
[]
["COL",null,3,4,5,6,7,8,9,10,11,12,13,14,15,16,17]
[]
[]
[null,"DP",10,{"$f":"IF(AND(V172>C165,V172<E165)=TRUE,V172,0)","v":0},25,{"$f":"IF(AND(V172>E165,V172<G165)=TRUE,V172,0)","v":0},50,{"$f":"IF(AND(V172>G165,V172<I165)=TRUE,V172,0)","v":0},75,{"$f":"IF(AND(V172>I165,V172<K165)=TRUE,V172,0)","v":0},100,{"$f":"IF(AND(V172>K165,V172<M165)=TRUE,V172,0)","v":0},150,{"$f":"IF(AND(V172>M165,V172<O165)=TRUE,V172,0)","v":0},250,{"$f":"IF(AND(V172>O165,V172<Q165)=TRUE,V172,0)","v":0},500]
["PM"]
[]
[0.5,null,6000,{"$f":"(E168-C168)/(E165-C165)*(D165-C165)+C168","v":4000},9000,{"$f":"(G168-E168)/(G165-E165)*(F165-E165)+E168","v":7000},11000,{"$f":"(I168-G168)/(I165-G165)*(H165-G165)+G168","v":10000},11500,{"$f":"(K168-I168)/(K165-I165)*(J165-I165)+I168","v":11499.699999999999},11500.1,{"$f":"(M168-K168)/(M165-K165)*(L165-K165)+K168","v":11499.9},11500.2,{"$f":"(O168-M168)/(O165-M165)*(N165-M165)+M168","v":11500.050000000003},11500.3,{"$f":"(Q168-O168)/(Q165-O165)*(P165-O165)+O168","v":11500.199999999999},11500.4,null,"PM","Q","Qcal","DPcal","DP","TIPO"]
[{"$f":"IF(AND(S172>A168,S172<A170)=TRUE,S172,0)","v":0},null,{"$f":"(C170-C168)/(A170-A168)*(A169-A168)+C168","v":5000},{"$f":"(E169-C169)/(E165-C165)*(D165-C165)+C169","v":3000},{"$f":"(E170-E168)/(A170-A168)*(A169-A168)+E168","v":8000},{"$f":"(G169-E169)/(G165-E165)*(F165-E165)+E169","v":9000},{"$f":"(G170-G168)/(A170-A168)*(A169-A168)+G168","v":7000},{"$f":"(I169-G169)/(I165-G165)*(H165-G165)+G169","v":5000.2000000000007},{"$f":"(I170-I168)/(A170-A168)*(A169-A168)+I168","v":7999.9},{"$f":"(K169-I169)/(K165-I165)*(J165-I165)+I169","v":7999.5999999999985},{"$f":"(K170-K168)/(A170-A168)*(A169-A168)+K168","v":8000},{"$f":"(M169-K169)/(M165-K165)*(L165-K165)+K169","v":7999.7999999999956},{"$f":"(M170-M168)/(A170-A168)*(A169-A168)+M168","v":8000.1000000000022},{"$f":"(O169-M169)/(O165-M165)*(N165-M165)+M169","v":7999.9500000000071},{"$f":"(O170-O168)/(A170-A168)*(A169-A168)+O168","v":8000.1999999999989},{"$f":"(Q169-O169)/(Q165-O165)*(P165-O165)+O169","v":8000.0899999999983},{"$f":"(Q170-Q168)/(A170-A168)*(A169-A168)+Q168","v":8000.3099999999995}]
[1,null,7000,{"$f":"(E170-C170)/(E165-C165)*(D165-C165)+C170","v":5000},10000,{"$f":"(G170-E170)/(G165-E165)*(F165-E165)+E170","v":5000},15000,{"$f":"(I170-G170)/(I165-G165)*(H165-G165)+G170","v":14999.8},15000.1,{"$f":"(K170-I170)/(K165-I165)*(J165-I165)+I170","v":14999.8},15000.2,{"$f":"(M170-K170)/(M165-K165)*(L165-K165)+K170","v":15000.000000000004},15000.3,{"$f":"(O170-M170)/(O165-M165)*(N165-M165)+M170","v":15000.149999999998},15000.4,{"$f":"(Q170-O170)/(Q165-O165)*(P165-O165)+O170","v":15000.31},15000.49,null,null,"нм3/час","нм3/час","мбар","мбар"]
[{"$f":"IF(AND(S172>A170,S172<A172)=TRUE,S172,0)","v":0},null,{"$f":"(C172-C170)/(A172-A170)*(A171-A170)+C170","v":6000},{"$f":"(E171-C171)/(E165-C165)*(D165-C165)+C171","v":5333.333333333333},{"$f":"(E172-E170)/(A172-A170)*(A171-A170)+E170","v":7000},{"$f":"(G171-E171)/(G165-E165)*(F165-E165)+E171","v":3000},{"$f":"(G172-G170)/(A172-A170)*(A171-A170)+G170","v":11000},{"$f":"(I171-G171)/(I165-G165)*(H165-G165)+G171","v":18999.599999999999},{"$f":"(I172-I170)/(A172-A170)*(A171-A170)+I170","v":7000.2000000000007},{"$f":"(K171-I171)/(K165-I165)*(J165-I165)+I171","v":6999.8999999999942},{"$f":"(K172-K170)/(A172-A170)*(A171-A170)+K170","v":7000.3000000000029},{"$f":"(M171-K171)/(M165-K165)*(L165-K165)+K171","v":7000.1000000000131},{"$f":"(M172-M170)/(A172-A170)*(A171-A170)+M170","v":7000.3999999999978},{"$f":"(O171-M171)/(O165-M165)*(N165-M165)+M171","v":7000.2499999999945},{"$f":"(O172-O170)/(A172-A170)*(A171-A170)+O170","v":7000.5},{"$f":"(Q171-O171)/(Q165-O165)*(P165-O165)+O171","v":7000.4200000000019},{"$f":"(Q172-Q170)/(A172-A170)*(A171-A170)+Q170","v":7000.5799999999981}]
[2,null,8000,{"$f":"(E172-C172)/(E165-C165)*(D165-C165)+C172","v":4666.666666666667},13000,{"$f":"(G172-E172)/(G165-E165)*(F165-E165)+E172","v":7000},19000,{"$f":"(I172-G172)/(I165-G165)*(H165-G165)+G172","v":11000},23000,{"$f":"(K172-I172)/(K165-I165)*(J165-I165)+I172","v":22999.700000000004},23000.1,{"$f":"(M172-K172)/(M165-K165)*(L165-K165)+K172","v":22999.899999999994},23000.2,{"$f":"(O172-M172)/(O165-M165)*(N165-M165)+M172","v":23000.050000000003},23000.3,{"$f":"(Q172-O172)/(Q165-O165)*(P165-O165)+O172","v":23000.199999999997},23000.400000000001,null,{"$f":"Лист1!B17*10","v":0.1},{"$f":"Лист1!B19","v":3500},{"$f":"VLOOKUP(S172,A165:Q180,HLOOKUP(V172,A165:Q180,16,0),0)","v":{"$error":"#N/A"}},{"$f":"Лист1!B18*10","v":100},{"$f":"IF(S172<A168,\"NO\",IF(S172>A178,\"N0\",IF(VLOOKUP(S172,A168:Q178,3,0)>T172,\"NO\",IF(VLOOKUP(S172,A168:Q178,17,0)<T172,\"NO\",IF(AND(U172>=T172-0.1,U172<T172+0.1)=TRUE,V172,\"NO\")))))","v":"NO"},"Фильтр газовый",{"$f":"Лист1!F16","v":"РЕД-С-6-1-300 DN300"}]
[{"$f":"IF(AND(S172>A172,S172<A174)=TRUE,S172,0)","v":0},null,{"$f":"(C174-C172)/(A174-A172)*(A173-A172)+C172","v":4333.3333333333339},{"$f":"(E173-C173)/(E165-C165)*(D165-C165)+C173","v":1666.6666666666683},{"$f":"(E174-E172)/(A174-A172)*(A173-A172)+E172","v":8333.3333333333321},{"$f":"(G173-E173)/(G165-E165)*(F165-E165)+E173","v":1666.6666666666633},{"$f":"(G174-G172)/(A174-A172)*(A173-A172)+G172","v":15000},{"$f":"(I173-G173)/(I165-G165)*(H165-G165)+G173","v":8333.3333333333358},{"$f":"(I174-I172)/(A174-A172)*(A173-A172)+I172","v":18333.333333333332},{"$f":"(K173-I173)/(K165-I165)*(J165-I165)+I173","v":28332.833333333336},{"$f":"(K174-K172)/(A174-A172)*(A173-A172)+K172","v":15000.166666666664},{"$f":"(M173-K173)/(M165-K165)*(L165-K165)+K173","v":28333.166666666657},{"$f":"(M174-M172)/(A174-A172)*(A173-A172)+M172","v":8333.6666666666679},{"$f":"(O173-M173)/(O165-M165)*(N165-M165)+M173","v":8333.5166666666701},{"$f":"(O174-O172)/(A174-A172)*(A173-A172)+O172","v":8333.7666666666664},{"$f":"(Q173-O173)/(Q165-O165)*(P165-O165)+O173","v":8333.6666666666624},{"$f":"(Q174-Q172)/(A174-A172)*(A173-A172)+Q172","v":8333.8666666666704}]
[5,null,13500,{"$f":"(E174-C174)/(E165-C165)*(D165-C165)+C174","v":9166.6666666666679},20000,{"$f":"(G174-E174)/(G165-E165)*(F165-E165)+E174","v":15000},25000,{"$f":"(I174-G174)/(I165-G165)*(H165-G165)+G174","v":15000},30000,{"$f":"(K174-I174)/(K165-I165)*(J165-I165)+I174","v":15000},35000,{"$f":"(M174-K174)/(M165-K165)*(L165-K165)+K174","v":15000},45000,{"$f":"(O174-M174)/(O165-M165)*(N165-M165)+M174","v":44999.850000000006},45000.1,{"$f":"(Q174-O174)/(Q165-O165)*(P165-O165)+O174","v":45000},45000.2]
[{"$f":"IF(AND(S172>A174,S172<A176)=TRUE,S172,0)","v":0},null,{"$f":"(C176-C174)/(A176-A174)*(A175-A174)+C174","v":8000},{"$f":"(E175-C175)/(E165-C165)*(D165-C165)+C175","v":5333.333333333333},{"$f":"(E176-E174)/(A176-A174)*(A175-A174)+E174","v":12000},{"$f":"(G175-E175)/(G165-E165)*(F165-E165)+E175","v":16000},{"$f":"(G176-G174)/(A176-A174)*(A175-A174)+G174","v":8000},{"$f":"(I175-G175)/(I165-G165)*(H165-G165)+G175","v":0},{"$f":"(I176-I174)/(A176-A174)*(A175-A174)+I174","v":12000},{"$f":"(K175-I175)/(K165-I165)*(J165-I165)+I175","v":-12000},{"$f":"(K176-K174)/(A176-A174)*(A175-A174)+K174","v":20000},{"$f":"(M175-K175)/(M165-K165)*(L165-K165)+K175","v":0},{"$f":"(M176-M174)/(A176-A174)*(A175-A174)+M174","v":30000},{"$f":"(O175-M175)/(O165-M165)*(N165-M165)+M175","v":67499.700000000012},{"$f":"(O176-O174)/(A176-A174)*(A175-A174)+O174","v":5000.1999999999971},{"$f":"(Q175-O175)/(Q165-O165)*(P165-O165)+O175","v":5000.1000000000058},{"$f":"(Q176-Q174)/(A176-A174)*(A175-A174)+Q174","v":5000.2999999999884}]
[10,null,19000,{"$f":"(E176-C176)/(E165-C165)*(D165-C165)+C176","v":13000},28000,{"$f":"(G176-E176)/(G165-E165)*(F165-E165)+E176","v":14000},42000,{"$f":"(I176-G176)/(I165-G165)*(H165-G165)+G176","v":30000},48000,{"$f":"(K176-I176)/(K165-I165)*(J165-I165)+I176","v":42000},50000,{"$f":"(M176-K176)/(M165-K165)*(L165-K165)+K176","v":30000},60000,{"$f":"(O176-M176)/(O165-M165)*(N165-M165)+M176","v":22500},85000,{"$f":"(Q176-O176)/(Q165-O165)*(P165-O165)+O176","v":84999.9},85000.1]
[{"$f":"IF(AND(S172>A176,S172<A178)=TRUE,S172,0)","v":0},null,{"$f":"(C178-C176)/(A178-A176)*(A177-A176)+C176","v":14000},{"$f":"(E177-C177)/(E165-C165)*(D165-C165)+C177","v":12444.444444444445},{"$f":"(E178-E176)/(A178-A176)*(A177-A176)+E176","v":16333.333333333332},{"$f":"(G177-E177)/(G165-E165)*(F165-E165)+E177","v":3999.9999999999964},{"$f":"(G178-G176)/(A178-A176)*(A177-A176)+G176","v":28666.666666666668},{"$f":"(I177-G177)/(I165-G165)*(H165-G165)+G177","v":36666.666666666672},{"$f":"(I178-I176)/(A178-A176)*(A177-A176)+I176","v":24666.666666666664},{"$f":"(K177-I177)/(K165-I165)*(J165-I165)+I177","v":48666.666666666664},{"$f":"(K178-K176)/(A178-A176)*(A177-A176)+K176","v":16666.666666666664},{"$f":"(M177-K177)/(M165-K165)*(L165-K165)+K177","v":13333.333333333336},{"$f":"(M178-M176)/(A178-A176)*(A177-A176)+M176","v":18333.333333333328},{"$f":"(O177-M177)/(O165-M165)*(N165-M165)+M177","v":-69166.666666666701},{"$f":"(O178-O176)/(A178-A176)*(A177-A176)+O176","v":76666.666666666672},{"$f":"(Q177-O177)/(Q165-O165)*(P165-O165)+O177","v":143333.06666666665},{"$f":"(Q178-Q176)/(A178-A176)*(A177-A176)+Q176","v":10000.266666666677}]
[16,null,22000,{"$f":"(E178-C178)/(E165-C165)*(D165-C165)+C178","v":13333.333333333334},35000,{"$f":"(G178-E178)/(G165-E165)*(F165-E165)+E178","v":20000},50000,{"$f":"(I178-G178)/(I165-G165)*(H165-G165)+G178","v":26000},62000,{"$f":"(K178-I178)/(K165-I165)*(J165-I165)+I178","v":38000},70000,{"$f":"(M178-K178)/(M165-K165)*(L165-K165)+K178","v":40000},85000,{"$f":"(O178-M178)/(O165-M165)*(N165-M165)+M178","v":77500},90000,{"$f":"(Q178-O178)/(Q165-O165)*(P165-O165)+O178","v":50000},130000]
[]
["COL",null,3,4,5,6,7,8,9,10,11,12,13,14,15,16,17]
[]
[]
[null,"DP",10,{"$f":"IF(AND(V190>C183,V190<E183)=TRUE,V190,0)","v":0},25,{"$f":"IF(AND(V190>E183,V190<G183)=TRUE,V190,0)","v":0},50,{"$f":"IF(AND(V190>G183,V190<I183)=TRUE,V190,0)","v":0},75,{"$f":"IF(AND(V190>I183,V190<K183)=TRUE,V190,0)","v":0},100,{"$f":"IF(AND(V190>K183,V190<M183)=TRUE,V190,0)","v":0},150,{"$f":"IF(AND(V190>M183,V190<O183)=TRUE,V190,0)","v":0},250,{"$f":"IF(AND(V190>O183,V190<Q183)=TRUE,V190,0)","v":0},500]
["PM"]
[]
[0.5,null,{"$f":"C168*1.5","v":9000},{"$f":"(E186-C186)/(E183-C183)*(D183-C183)+C186","v":6000},{"$f":"E168*1.5","v":13500},{"$f":"(G186-E186)/(G183-E183)*(F183-E183)+E186","v":8300},{"$f":"G168*1.7","v":18700},{"$f":"(I186-G186)/(I183-G183)*(H183-G183)+G186","v":17000},{"$f":"I168*1.7","v":19550},{"$f":"(K186-I186)/(K183-I183)*(J183-I183)+I186","v":19549.489999999994},{"$f":"K168*1.7","v":19550.170000000002},{"$f":"(M186-K186)/(M183-K183)*(L183-K183)+K186","v":19549.830000000005},{"$f":"M168*1.7","v":19550.34},{"$f":"(O186-M186)/(O183-M183)*(N183-M183)+M186","v":19550.34},{"$f":"M186","v":19550.34},{"$f":"(Q186-O186)/(Q183-O183)*(P183-O183)+O186","v":19550.34},{"$f":"O186","v":19550.34},null,"PM","Q","Qcal","DPcal","DP","TIPO"]
[{"$f":"IF(AND(S190>A186,S190<A188)=TRUE,S190,0)","v":0},null,{"$f":"(C188-C186)/(A188-A186)*(A187-A186)+C186","v":7500},{"$f":"(E187-C187)/(E183-C183)*(D183-C183)+C187","v":4500},{"$f":"(E188-E186)/(A188-A186)*(A187-A186)+E186","v":12000},{"$f":"(G187-E187)/(G183-E183)*(F183-E183)+E187","v":12100},{"$f":"(G188-G186)/(A188-A186)*(A187-A186)+G186","v":11900},{"$f":"(I187-G187)/(I183-G183)*(H183-G183)+G187","v":8500.3399999999965},{"$f":"(I188-I186)/(A188-A186)*(A187-A186)+I186","v":13599.830000000002},{"$f":"(K187-I187)/(K183-I183)*(J183-I183)+I187","v":13599.319999999996},{"$f":"(K188-K186)/(A188-A186)*(A187-A186)+K186","v":13600.000000000004},{"$f":"(M187-K187)/(M183-K183)*(L183-K183)+K187","v":13599.320000000011},{"$f":"(M188-M186)/(A188-A186)*(A187-A186)+M186","v":13600.34},{"$f":"(O187-M187)/(O183-M183)*(N183-M183)+M187","v":13600.34},{"$f":"(O188-O186)/(A188-A186)*(A187-A186)+O186","v":13600.34},{"$f":"(Q187-O187)/(Q183-O183)*(P183-O183)+O187","v":13600.34},{"$f":"(Q188-Q186)/(A188-A186)*(A187-A186)+Q186","v":13600.34}]
[1,null,{"$f":"C170*1.5","v":10500},{"$f":"(E188-C188)/(E183-C183)*(D183-C183)+C188","v":7500},{"$f":"E170*1.5","v":15000},{"$f":"(G188-E188)/(G183-E183)*(F183-E183)+E188","v":4500},{"$f":"G170*1.7","v":25500},{"$f":"(I188-G188)/(I183-G183)*(H183-G183)+G188","v":25499.660000000003},{"$f":"I170*1.7","v":25500.17},{"$f":"(K188-I188)/(K183-I183)*(J183-I183)+I188","v":25499.659999999993},{"$f":"K170*1.7","v":25500.34},{"$f":"(M188-K188)/(M183-K183)*(L183-K183)+K188","v":25500.34},{"$f":"K188","v":25500.34},{"$f":"(O188-M188)/(O183-M183)*(N183-M183)+M188","v":25500.34},{"$f":"M188","v":25500.34},{"$f":"(Q188-O188)/(Q183-O183)*(P183-O183)+O188","v":25500.34},{"$f":"O188","v":25500.34},null,null,"нм3/час","нм3/час","мбар","мбар"]
[{"$f":"IF(AND(S190>A188,S190<A190)=TRUE,S190,0)","v":0},null,{"$f":"(C190-C188)/(A190-A188)*(A189-A188)+C188","v":9000},{"$f":"(E189-C189)/(E183-C183)*(D183-C183)+C189","v":8000},{"$f":"(E190-E188)/(A190-A188)*(A189-A188)+E188","v":10500},{"$f":"(G189-E189)/(G183-E183)*(F183-E183)+E189","v":2300},{"$f":"(G190-G188)/(A190-A188)*(A189-A188)+G188","v":18700},{"$f":"(I189-G189)/(I183-G183)*(H183-G183)+G189","v":32299.320000000007},{"$f":"(I190-I188)/(A190-A188)*(A189-A188)+I188","v":11900.339999999997},{"$f":"(K189-I189)/(K183-I183)*(J183-I183)+I189","v":11899.82999999998},{"$f":"(K190-K188)/(A190-A188)*(A189-A188)+K188","v":11900.510000000002},{"$f":"(M189-K189)/(M183-K183)*(L183-K183)+K189","v":11900.850000000013},{"$f":"(M190-M188)/(A190-A188)*(A189-A188)+M188","v":11900.339999999997},{"$f":"(O189-M189)/(O183-M183)*(N183-M183)+M189","v":11900.339999999997},{"$f":"(O190-O188)/(A190-A188)*(A189-A188)+O188","v":11900.339999999997},{"$f":"(Q189-O189)/(Q183-O183)*(P183-O183)+O189","v":11900.339999999997},{"$f":"(Q190-Q188)/(A190-A188)*(A189-A188)+Q188","v":11900.339999999997}]
[2,null,{"$f":"C172*1.5","v":12000},{"$f":"(E190-C190)/(E183-C183)*(D183-C183)+C190","v":7000},{"$f":"E172*1.5","v":19500},{"$f":"(G190-E190)/(G183-E183)*(F183-E183)+E190","v":6700},{"$f":"G172*1.7","v":32300},{"$f":"(I190-G190)/(I183-G183)*(H183-G183)+G190","v":18700},{"$f":"I172*1.7","v":39100},{"$f":"(K190-I190)/(K183-I183)*(J183-I183)+I190","v":39099.490000000005},{"$f":"K172*1.7","v":39100.17},{"$f":"(M190-K190)/(M183-K183)*(L183-K183)+K190","v":39099.829999999987},{"$f":"M172*1.7","v":39100.340000000004},{"$f":"(O190-M190)/(O183-M183)*(N183-M183)+M190","v":39100.340000000004},{"$f":"M190","v":39100.340000000004},{"$f":"(Q190-O190)/(Q183-O183)*(P183-O183)+O190","v":39100.340000000004},{"$f":"M190","v":39100.340000000004},null,{"$f":"Лист1!B17*10","v":0.1},{"$f":"Лист1!B19","v":3500},{"$f":"VLOOKUP(S190,A183:Q198,HLOOKUP(V190,A183:Q198,16,0),0)","v":{"$error":"#N/A"}},{"$f":"Лист1!B18*10","v":100},{"$f":"IF(S190<A186,\"NO\",IF(S190>A196,\"N0\",IF(VLOOKUP(S190,A186:Q196,3,0)>T190,\"NO\",IF(VLOOKUP(S190,A186:Q196,17,0)<T190,\"NO\",IF(AND(U190>=T190-0.1,U190<T190+0.1)=TRUE,V190,\"NO\")))))","v":"NO"},"Фильтр газовый",{"$f":"Лист1!F17","v":"РЕД-С-8-1-400 DN400"}]
[{"$f":"IF(AND(S190>A190,S190<A192)=TRUE,S190,0)","v":0},null,{"$f":"(C192-C190)/(A192-A190)*(A191-A190)+C190","v":6500},{"$f":"(E191-C191)/(E183-C183)*(D183-C183)+C191","v":2500},{"$f":"(E192-E190)/(A192-A190)*(A191-A190)+E190","v":12500},{"$f":"(G191-E191)/(G183-E183)*(F183-E183)+E191","v":-500},{"$f":"(G192-G190)/(A192-A190)*(A191-A190)+G190","v":25500},{"$f":"(I191-G191)/(I183-G183)*(H183-G183)+G191","v":14166.666666666664},{"$f":"(I192-I190)/(A192-A190)*(A191-A190)+I190","v":31166.666666666668},{"$f":"(K191-I191)/(K183-I183)*(J183-I183)+I191","v":48165.816666666673},{"$f":"(K192-K190)/(A192-A190)*(A191-A190)+K190","v":25500.283333333333},{"$f":"(M191-K191)/(M183-K183)*(L183-K183)+K191","v":48166.383333333317},{"$f":"(M192-M190)/(A192-A190)*(A191-A190)+M190","v":14167.233333333341},{"$f":"(O191-M191)/(O183-M183)*(N183-M183)+M191","v":14167.403333333343},{"$f":"(O192-O190)/(A192-A190)*(A191-A190)+O190","v":14167.120000000006},{"$f":"(Q191-O191)/(Q183-O183)*(P183-O183)+O191","v":14167.233333333337},{"$f":"(Q192-Q190)/(A192-A190)*(A191-A190)+Q190","v":14167.006666666675}]
[5,null,{"$f":"C174*1.5","v":20250},{"$f":"(E192-C192)/(E183-C183)*(D183-C183)+C192","v":13750},{"$f":"E174*1.5","v":30000},{"$f":"(G192-E192)/(G183-E183)*(F183-E183)+E192","v":17500},{"$f":"G174*1.7","v":42500},{"$f":"(I192-G192)/(I183-G183)*(H183-G183)+G192","v":25500},{"$f":"I174*1.7","v":51000},{"$f":"(K192-I192)/(K183-I183)*(J183-I183)+I192","v":25500},{"$f":"K174*1.7","v":59500},{"$f":"(M192-K192)/(M183-K183)*(L183-K183)+K192","v":25500},{"$f":"M174*1.7","v":76500},{"$f":"(O192-M192)/(O183-M183)*(N183-M183)+M192","v":76499.744999999995},{"$f":"O174*1.7","v":76500.17},{"$f":"(Q192-O192)/(Q183-O183)*(P183-O183)+O192","v":76500},{"$f":"Q174*1.7","v":76500.34}]
[{"$f":"IF(AND(S190>A192,S190<A194)=TRUE,S190,0)","v":0},null,{"$f":"(C194-C192)/(A194-A192)*(A193-A192)+C192","v":12000},{"$f":"(E193-C193)/(E183-C183)*(D183-C183)+C193","v":8000},{"$f":"(E194-E192)/(A194-A192)*(A193-A192)+E192","v":18000},{"$f":"(G193-E193)/(G183-E183)*(F183-E183)+E193","v":22400},{"$f":"(G194-G192)/(A194-A192)*(A193-A192)+G192","v":13600},{"$f":"(I193-G193)/(I183-G183)*(H183-G183)+G193","v":0},{"$f":"(I194-I192)/(A194-A192)*(A193-A192)+I192","v":20400},{"$f":"(K193-I193)/(K183-I183)*(J183-I183)+I193","v":-20400},{"$f":"(K194-K192)/(A194-A192)*(A193-A192)+K192","v":34000},{"$f":"(M193-K193)/(M183-K183)*(L183-K183)+K193","v":0},{"$f":"(M194-M192)/(A194-A192)*(A193-A192)+M192","v":51000},{"$f":"(O193-M193)/(O183-M183)*(N183-M183)+M193","v":114749.49},{"$f":"(O194-O192)/(A194-A192)*(A193-A192)+O192","v":8500.3399999999965},{"$f":"(Q193-O193)/(Q183-O183)*(P183-O183)+O193","v":8500.1700000000128},{"$f":"(Q194-Q192)/(A194-A192)*(A193-A192)+Q192","v":8500.5099999999802}]
[10,null,{"$f":"C176*1.5","v":28500},{"$f":"(E194-C194)/(E183-C183)*(D183-C183)+C194","v":19500},{"$f":"E176*1.5","v":42000},{"$f":"(G194-E194)/(G183-E183)*(F183-E183)+E194","v":12600},{"$f":"G176*1.7","v":71400},{"$f":"(I194-G194)/(I183-G183)*(H183-G183)+G194","v":51000},{"$f":"I176*1.7","v":81600},{"$f":"(K194-I194)/(K183-I183)*(J183-I183)+I194","v":71400},{"$f":"K176*1.7","v":85000},{"$f":"(M194-K194)/(M183-K183)*(L183-K183)+K194","v":51000},{"$f":"M176*1.7","v":102000},{"$f":"(O194-M194)/(O183-M183)*(N183-M183)+M194","v":38250},{"$f":"O176*1.7","v":144500},{"$f":"(Q194-O194)/(Q183-O183)*(P183-O183)+O194","v":144499.82999999999},{"$f":"Q176*1.7","v":144500.17000000001}]
[{"$f":"IF(AND(S190>A194,S190<A196)=TRUE,S190,0)","v":0},null,{"$f":"(C196-C194)/(A196-A194)*(A195-A194)+C194","v":21000},{"$f":"(E195-C195)/(E183-C183)*(D183-C183)+C195","v":18666.666666666668},{"$f":"(E196-E194)/(A196-A194)*(A195-A194)+E194","v":24500},{"$f":"(G195-E195)/(G183-E183)*(F183-E183)+E195","v":266.66666666666424},{"$f":"(G196-G194)/(A196-A194)*(A195-A194)+G194","v":48733.333333333336},{"$f":"(I195-G195)/(I183-G183)*(H183-G183)+G195","v":62333.333333333336},{"$f":"(I196-I194)/(A196-A194)*(A195-A194)+I194","v":41933.333333333336},{"$f":"(K195-I195)/(K183-I183)*(J183-I183)+I195","v":82733.333333333372},{"$f":"(K196-K194)/(A196-A194)*(A195-A194)+K194","v":28333.333333333328},{"$f":"(M195-K195)/(M183-K183)*(L183-K183)+K195","v":22666.666666666642},{"$f":"(M196-M194)/(A196-A194)*(A195-A194)+M194","v":31166.666666666672},{"$f":"(O195-M195)/(O183-M183)*(N183-M183)+M195","v":-117583.3333333333},{"$f":"(O196-O194)/(A196-A194)*(A195-A194)+O194","v":130333.33333333333},{"$f":"(Q195-O195)/(Q183-O183)*(P183-O183)+O195","v":243666.21333333329},{"$f":"(Q196-Q194)/(A196-A194)*(A195-A194)+Q194","v":17000.453333333367}]
[16,null,{"$f":"C178*1.5","v":33000},{"$f":"(E196-C196)/(E183-C183)*(D183-C183)+C196","v":20000},{"$f":"E178*1.5","v":52500},{"$f":"(G196-E196)/(G183-E183)*(F183-E183)+E196","v":20000},{"$f":"G178*1.7","v":85000},{"$f":"(I196-G196)/(I183-G183)*(H183-G183)+G196","v":44200},{"$f":"I178*1.7","v":105400},{"$f":"(K196-I196)/(K183-I183)*(J183-I183)+I196","v":64600},{"$f":"K178*1.7","v":119000},{"$f":"(M196-K196)/(M183-K183)*(L183-K183)+K196","v":68000},{"$f":"M178*1.7","v":144500},{"$f":"(O196-M196)/(O183-M183)*(N183-M183)+M196","v":131750},{"$f":"O178*1.7","v":153000},{"$f":"(Q196-O196)/(Q183-O183)*(P183-O183)+O196","v":85000},{"$f":"Q178*1.7","v":221000}]
[]
["COL",null,3,4,5,6,7,8,9,10,11,12,13,14,15,16,17]
[]
[]
[null,"DP",10,{"$f":"IF(AND(V208>C201,V208<E201)=TRUE,V208,0)","v":0},20,{"$f":"IF(AND(V208>E201,V208<G201)=TRUE,V208,0)","v":0},30,{"$f":"IF(AND(V208>G201,V208<I201)=TRUE,V208,0)","v":0},40,{"$f":"IF(AND(V208>I201,V208<K201)=TRUE,V208,0)","v":0},50,{"$f":"IF(AND(V208>K201,V208<M201)=TRUE,V208,0)","v":0},75,{"$f":"IF(AND(V208>M201,V208<O201)=TRUE,V208,0)","v":0},100,{"$f":"IF(AND(V208>O201,V208<Q201)=TRUE,V208,0)","v":0},100]
["PM"]
[]
[0.1,null,43,{"$f":"(E204-C204)/(E201-C201)*(D201-C201)+C204","v":23},63,{"$f":"(G204-E204)/(G201-E201)*(F201-E201)+E204","v":37},76,{"$f":"(I204-G204)/(I201-G201)*(H201-G201)+G204","v":34},90,{"$f":"(K204-I204)/(K201-I201)*(J201-I201)+I204","v":50},100,{"$f":"(M204-K204)/(M201-K201)*(L201-K201)+K204","v":40},130,{"$f":"(O204-M204)/(O201-M201)*(N201-M201)+M204","v":70},150,{"$f":"(Q204-O204)/(Q201-O201)*(P201-O201)+O204","v":{"$error":"#DIV/0!"}},150,null,"PM","Q","Qcal","DPcal","DP","TIPO"]
[{"$f":"IF(AND(S208>A204,S208<A206)=TRUE,S208,0)","v":0},null,{"$f":"(C206-C204)/(A206-A204)*(A205-A204)+C204","v":41.75},{"$f":"(E205-C205)/(E201-C201)*(D201-C201)+C205","v":22.25},{"$f":"(E206-E204)/(A206-A204)*(A205-A204)+E204","v":61.25},{"$f":"(G205-E205)/(G201-E201)*(F201-E201)+E205","v":38.75},{"$f":"(G206-G204)/(A206-A204)*(A205-A204)+G204","v":72.5},{"$f":"(I205-G205)/(I201-G201)*(H201-G201)+G205","v":35},{"$f":"(I206-I204)/(A206-A204)*(A205-A204)+I204","v":85},{"$f":"(K205-I205)/(K201-I201)*(J201-I201)+I205","v":45},{"$f":"(K206-K204)/(A206-A204)*(A205-A204)+K204","v":95},{"$f":"(M205-K205)/(M201-K201)*(L201-K201)+K205","v":35},{"$f":"(M206-M204)/(A206-A204)*(A205-A204)+M204","v":125},{"$f":"(O205-M205)/(O201-M201)*(N201-M201)+M205","v":65},{"$f":"(O206-O204)/(A206-A204)*(A205-A204)+O204","v":145},{"$f":"(Q205-O205)/(Q201-O201)*(P201-O201)+O205","v":{"$error":"#DIV/0!"}},{"$f":"(Q206-Q204)/(A206-A204)*(A205-A204)+Q204","v":145}]
[0.5,null,48,{"$f":"(E206-C206)/(E201-C201)*(D201-C201)+C206","v":26},70,{"$f":"(G206-E206)/(G201-E201)*(F201-E201)+E206","v":30},90,{"$f":"(I206-G206)/(I201-G201)*(H201-G201)+G206","v":30},110,{"$f":"(K206-I206)/(K201-I201)*(J201-I201)+I206","v":70},120,{"$f":"(M206-K206)/(M201-K201)*(L201-K201)+K206","v":60},150,{"$f":"(O206-M206)/(O201-M201)*(N201-M201)+M206","v":90},170,{"$f":"(Q206-O206)/(Q201-O201)*(P201-O201)+O206","v":{"$error":"#DIV/0!"}},170,null,null,"нм3/час","нм3/час","мбар","мбар"]
[{"$f":"IF(AND(S208>A206,S208<A208)=TRUE,S208,0)","v":0},null,{"$f":"(C208-C206)/(A208-A206)*(A207-A206)+C206","v":38},{"$f":"(E207-C207)/(E201-C201)*(D201-C201)+C207","v":18},{"$f":"(E208-E206)/(A208-A206)*(A207-A206)+E206","v":58},{"$f":"(G207-E207)/(G201-E201)*(F201-E201)+E207","v":24},{"$f":"(G208-G206)/(A208-A206)*(A207-A206)+G206","v":75},{"$f":"(I207-G207)/(I201-G201)*(H201-G201)+G207","v":15},{"$f":"(I208-I206)/(A208-A206)*(A207-A206)+I206","v":95},{"$f":"(K207-I207)/(K201-I201)*(J201-I201)+I207","v":35},{"$f":"(K208-K206)/(A208-A206)*(A207-A206)+K206","v":110},{"$f":"(M207-K207)/(M201-K201)*(L201-K201)+K207","v":80},{"$f":"(M208-M206)/(A208-A206)*(A207-A206)+M206","v":125},{"$f":"(O207-M207)/(O201-M201)*(N201-M201)+M207","v":80},{"$f":"(O208-O206)/(A208-A206)*(A207-A206)+O206","v":140},{"$f":"(Q207-O207)/(Q201-O201)*(P201-O201)+O207","v":{"$error":"#DIV/0!"}},{"$f":"(Q208-Q206)/(A208-A206)*(A207-A206)+Q206","v":140}]
[1,null,58,{"$f":"(E208-C208)/(E201-C201)*(D201-C201)+C208","v":34},82,{"$f":"(G208-E208)/(G201-E201)*(F201-E201)+E208","v":36},105,{"$f":"(I208-G208)/(I201-G201)*(H201-G201)+G208","v":45},125,{"$f":"(K208-I208)/(K201-I201)*(J201-I201)+I208","v":105},130,{"$f":"(M208-K208)/(M201-K201)*(L201-K201)+K208","v":40},175,{"$f":"(O208-M208)/(O201-M201)*(N201-M201)+M208","v":100},200,{"$f":"(Q208-O208)/(Q201-O201)*(P201-O201)+O208","v":{"$error":"#DIV/0!"}},200,null,{"$f":"Лист1!B17*10","v":0.1},{"$f":"Лист1!B19","v":3500},{"$f":"VLOOKUP(S208,A201:Q216,HLOOKUP(V208,A201:Q216,16,0),0)","v":150},{"$f":"Лист1!B18*10","v":100},{"$f":"IF(S208<A204,\"NO\",IF(S208>A214,\"N0\",IF(VLOOKUP(S208,A204:Q214,3,0)>T208,\"NO\",IF(VLOOKUP(S208,A204:Q214,17,0)<T208,\"NO\",IF(AND(U208>=T208-0.1,U208<T208+0.1)=TRUE,V208,\"NO\")))))","v":"NO"},"Фильтр газовый",{"$f":"Лист1!F4","v":"РЕД-25 DN25"}]
[{"$f":"IF(AND(S208>A208,S208<A210)=TRUE,S208,0)","v":0},null,{"$f":"(C210-C208)/(A210-A208)*(A209-A208)+C208","v":49.6},{"$f":"(E209-C209)/(E201-C201)*(D201-C201)+C209","v":28.799999999999997},{"$f":"(E210-E208)/(A210-A208)*(A209-A208)+E208","v":70.400000000000006},{"$f":"(G209-E209)/(G201-E201)*(F201-E201)+E209","v":27.200000000000017},{"$f":"(G210-G208)/(A210-A208)*(A209-A208)+G208","v":92},{"$f":"(I209-G209)/(I201-G201)*(H201-G201)+G209","v":32},{"$f":"(I210-I208)/(A210-A208)*(A209-A208)+I208","v":112},{"$f":"(K209-I209)/(K201-I201)*(J201-I201)+I209","v":104},{"$f":"(K210-K208)/(A210-A208)*(A209-A208)+K208","v":114},{"$f":"(M209-K209)/(M201-K201)*(L201-K201)+K209","v":26},{"$f":"(M210-M208)/(A210-A208)*(A209-A208)+M208","v":158},{"$f":"(O209-M209)/(O201-M201)*(N201-M201)+M209","v":92},{"$f":"(O210-O208)/(A210-A208)*(A209-A208)+O208","v":180},{"$f":"(Q209-O209)/(Q201-O201)*(P201-O201)+O209","v":{"$error":"#DIV/0!"}},{"$f":"(Q210-Q208)/(A210-A208)*(A209-A208)+Q208","v":180}]
[6,null,100,{"$f":"(E210-C210)/(E201-C201)*(D201-C201)+C210","v":60},140,{"$f":"(G210-E210)/(G201-E201)*(F201-E201)+E210","v":80},170,{"$f":"(I210-G210)/(I201-G201)*(H201-G201)+G210","v":110},190,{"$f":"(K210-I210)/(K201-I201)*(J201-I201)+I210","v":110},210,{"$f":"(M210-K210)/(M201-K201)*(L201-K201)+K210","v":110},260,{"$f":"(O210-M210)/(O201-M201)*(N201-M201)+M210","v":140},300,{"$f":"(Q210-O210)/(Q201-O201)*(P201-O201)+O210","v":{"$error":"#DIV/0!"}},300]
[{"$f":"IF(AND(S208>A210,S208<A212)=TRUE,S208,0)","v":0},null,{"$f":"(C212-C210)/(A212-A210)*(A211-A210)+C210","v":-180},{"$f":"(E211-C211)/(E201-C201)*(D201-C201)+C211","v":-170},{"$f":"(E212-E210)/(A212-A210)*(A211-A210)+E210","v":-190},{"$f":"(G211-E211)/(G201-E201)*(F201-E201)+E211","v":-190},{"$f":"(G212-G210)/(A212-A210)*(A211-A210)+G210","v":-190},{"$f":"(I211-G211)/(I201-G201)*(H201-G201)+G211","v":-160},{"$f":"(I212-I210)/(A212-A210)*(A211-A210)+I210","v":-200},{"$f":"(K211-I211)/(K201-I201)*(J201-I201)+I211","v":0},{"$f":"(K212-K210)/(A212-A210)*(A211-A210)+K210","v":-250},{"$f":"(M211-K211)/(M201-K201)*(L201-K201)+K211","v":-29.999999999999972},{"$f":"(M212-M210)/(A212-A210)*(A211-A210)+M210","v":-360},{"$f":"(O211-M211)/(O201-M201)*(N201-M201)+M211","v":-240},{"$f":"(O212-O210)/(A212-A210)*(A211-A210)+O210","v":-400},{"$f":"(Q211-O211)/(Q201-O201)*(P201-O201)+O211","v":{"$error":"#DIV/0!"}},{"$f":"(Q212-Q210)/(A212-A210)*(A211-A210)+Q210","v":-400}]
[12,null,380,{"$f":"(E212-C212)/(E201-C201)*(D201-C201)+C212","v":290},470,{"$f":"(G212-E212)/(G201-E201)*(F201-E201)+E212","v":350},530,{"$f":"(I212-G212)/(I201-G201)*(H201-G201)+G212","v":380},580,{"$f":"(K212-I212)/(K201-I201)*(J201-I201)+I212","v":220},670,{"$f":"(M212-K212)/(M201-K201)*(L201-K201)+K212","v":250},880,{"$f":"(O212-M212)/(O201-M201)*(N201-M201)+M212","v":520},1000,{"$f":"(Q212-O212)/(Q201-O201)*(P201-O201)+O212","v":{"$error":"#DIV/0!"}},1000]
[{"$f":"IF(AND(S208>A212,S208<A214)=TRUE,S208,0)","v":0},null,{"$f":"(C214-C212)/(A214-A212)*(A213-A212)+C212","v":20},{"$f":"(E213-C213)/(E201-C201)*(D201-C201)+C213","v":-40},{"$f":"(E214-E212)/(A214-A212)*(A213-A212)+E212","v":80},{"$f":"(G213-E213)/(G201-E201)*(F201-E201)+E213","v":20},{"$f":"(G214-G212)/(A214-A212)*(A213-A212)+G212","v":110},{"$f":"(I213-G213)/(I201-G201)*(H201-G201)+G213","v":50},{"$f":"(I214-I212)/(A214-A212)*(A213-A212)+I212","v":130},{"$f":"(K213-I213)/(K201-I201)*(J201-I201)+I213","v":370},{"$f":"(K214-K212)/(A214-A212)*(A213-A212)+K212","v":70},{"$f":"(M213-K213)/(M201-K201)*(L201-K201)+K213","v":190},{"$f":"(M214-M212)/(A214-A212)*(A213-A212)+M212","v":10},{"$f":"(O213-M213)/(O201-M201)*(N201-M201)+M213","v":190},{"$f":"(O214-O212)/(A214-A212)*(A213-A212)+O212","v":-50},{"$f":"(Q213-O213)/(Q201-O201)*(P201-O201)+O213","v":{"$error":"#DIV/0!"}},{"$f":"(Q214-Q212)/(A214-A212)*(A213-A212)+Q212","v":-50}]
[16,null,500,{"$f":"(E214-C214)/(E201-C201)*(D201-C201)+C214","v":400},600,{"$f":"(G214-E214)/(G201-E201)*(F201-E201)+E214","v":460},670,{"$f":"(I214-G214)/(I201-G201)*(H201-G201)+G214","v":490},730,{"$f":"(K214-I214)/(K201-I201)*(J201-I201)+I214","v":170},870,{"$f":"(M214-K214)/(M201-K201)*(L201-K201)+K214","v":270},1170,{"$f":"(O214-M214)/(O201-M201)*(N201-M201)+M214","v":630},1350,{"$f":"(Q214-O214)/(Q201-O201)*(P201-O201)+O214","v":{"$error":"#DIV/0!"}},1350]
[]
["COL",null,3,4,5,6,7,8,9,10,11,12,13,14,15,16,17]
[]
[]
[null,"DP",10,{"$f":"IF(AND(V226>C219,V226<E219)=TRUE,V226,0)","v":0},20,{"$f":"IF(AND(V226>E219,V226<G219)=TRUE,V226,0)","v":0},30,{"$f":"IF(AND(V226>G219,V226<I219)=TRUE,V226,0)","v":0},40,{"$f":"IF(AND(V226>I219,V226<K219)=TRUE,V226,0)","v":0},50,{"$f":"IF(AND(V226>K219,V226<M219)=TRUE,V226,0)","v":0},75,{"$f":"IF(AND(V226>M219,V226<O219)=TRUE,V226,0)","v":0},100,{"$f":"IF(AND(V226>O219,V226<Q219)=TRUE,V226,0)","v":0},150]
["PM"]
[]
[0.5,null,150,{"$f":"(E222-C222)/(E219-C219)*(D219-C219)+C222","v":65},235,{"$f":"(G222-E222)/(G219-E219)*(F219-E219)+E222","v":135},285,{"$f":"(I222-G222)/(I219-G219)*(H219-G219)+G222","v":165},325,{"$f":"(K222-I222)/(K219-I219)*(J219-I219)+I222","v":225},350,{"$f":"(M222-K222)/(M219-K219)*(L219-K219)+K222","v":150},450,{"$f":"(O222-M222)/(O219-M219)*(N219-M219)+M222","v":225},525,{"$f":"(Q222-O222)/(Q219-O219)*(P219-O219)+O222","v":325},625,null,"PM","Q","Qcal","DPcal","DP","TIPO"]
[{"$f":"IF(AND(S226>A222,S226<A224)=TRUE,S226,0)","v":0},null,{"$f":"(C224-C222)/(A224-A222)*(A223-A222)+C222","v":65},{"$f":"(E223-C223)/(E219-C219)*(D219-C219)+C223","v":-5},{"$f":"(E224-E222)/(A224-A222)*(A223-A222)+E222","v":135},{"$f":"(G223-E223)/(G219-E219)*(F219-E219)+E223","v":65},{"$f":"(G224-G222)/(A224-A222)*(A223-A222)+G222","v":170},{"$f":"(I223-G223)/(I219-G219)*(H219-G219)+G223","v":80},{"$f":"(I224-I222)/(A224-A222)*(A223-A222)+I222","v":200},{"$f":"(K223-I223)/(K219-I219)*(J219-I219)+I223","v":200},{"$f":"(K224-K222)/(A224-A222)*(A223-A222)+K222","v":200},{"$f":"(M223-K223)/(M219-K219)*(L219-K219)+K223","v":-29.999999999999972},{"$f":"(M224-M222)/(A224-A222)*(A223-A222)+M222","v":315},{"$f":"(O223-M223)/(O219-M219)*(N219-M219)+M223","v":135},{"$f":"(O224-O222)/(A224-A222)*(A223-A222)+O222","v":375},{"$f":"(Q223-O223)/(Q219-O219)*(P219-O219)+O223","v":245},{"$f":"(Q224-Q222)/(A224-A222)*(A223-A222)+Q222","v":440}]
[1,null,235,{"$f":"(E224-C224)/(E219-C219)*(D219-C219)+C224","v":135},335,{"$f":"(G224-E224)/(G219-E219)*(F219-E219)+E224","v":205},400,{"$f":"(I224-G224)/(I219-G219)*(H219-G219)+G224","v":250},450,{"$f":"(K224-I224)/(K219-I219)*(J219-I219)+I224","v":250},500,{"$f":"(M224-K224)/(M219-K219)*(L219-K219)+K224","v":330},585,{"$f":"(O224-M224)/(O219-M219)*(N219-M219)+M224","v":315},675,{"$f":"(Q224-O224)/(Q219-O219)*(P219-O219)+O224","v":405},810,null,null,"нм3/час","нм3/час","мбар","мбар"]
[{"$f":"IF(AND(S226>A224,S226<A226)=TRUE,S226,0)","v":0},null,{"$f":"(C226-C224)/(A226-A224)*(A225-A224)+C224","v":195},{"$f":"(E225-C225)/(E219-C219)*(D219-C219)+C225","v":105},{"$f":"(E226-E224)/(A226-A224)*(A225-A224)+E224","v":285},{"$f":"(G225-E225)/(G219-E219)*(F219-E219)+E225","v":170},{"$f":"(G226-G224)/(A226-A224)*(A225-A224)+G224","v":342.5},{"$f":"(I225-G225)/(I219-G219)*(H219-G219)+G225","v":200},{"$f":"(I226-I224)/(A226-A224)*(A225-A224)+I224","v":390},{"$f":"(K225-I225)/(K219-I219)*(J219-I219)+I225","v":190},{"$f":"(K226-K224)/(A226-A224)*(A225-A224)+K224","v":440},{"$f":"(M225-K225)/(M219-K219)*(L219-K219)+K225","v":300},{"$f":"(M226-M224)/(A226-A224)*(A225-A224)+M224","v":510},{"$f":"(O225-M225)/(O219-M219)*(N219-M219)+M225","v":225},{"$f":"(O226-O224)/(A226-A224)*(A225-A224)+O224","v":605},{"$f":"(Q225-O225)/(Q219-O219)*(P219-O219)+O225","v":370},{"$f":"(Q226-Q224)/(A226-A224)*(A225-A224)+Q224","v":722.5}]
[3,null,315,{"$f":"(E226-C226)/(E219-C219)*(D219-C219)+C226","v":195},435,{"$f":"(G226-E226)/(G219-E219)*(F219-E219)+E226","v":275},515,{"$f":"(I226-G226)/(I219-G219)*(H219-G219)+G226","v":350},570,{"$f":"(K226-I226)/(K219-I219)*(J219-I219)+I226","v":370},620,{"$f":"(M226-K226)/(M219-K219)*(L219-K219)+K226","v":390},735,{"$f":"(O226-M226)/(O219-M219)*(N219-M219)+M226","v":495},815,{"$f":"(Q226-O226)/(Q219-O219)*(P219-O219)+O226","v":475},985,null,{"$f":"Лист1!B17*10","v":0.1},{"$f":"Лист1!B19","v":3500},{"$f":"VLOOKUP(S226,A219:Q234,HLOOKUP(V226,A219:Q234,16,0),0)","v":{"$error":"#N/A"}},{"$f":"Лист1!B18*10","v":100},{"$f":"IF(S226<A222,\"NO\",IF(S226>A232,\"N0\",IF(VLOOKUP(S226,A222:Q232,3,0)>T226,\"NO\",IF(VLOOKUP(S226,A222:Q232,17,0)<T226,\"NO\",IF(AND(U226>=T226-0.1,U226<T226+0.1)=TRUE,V226,\"NO\")))))","v":"NO"},"Фильтр газовый",{"$f":"Лист1!F5","v":"РЕД-40 DN40"}]
[{"$f":"IF(AND(S226>A226,S226<A228)=TRUE,S226,0)","v":0},null,{"$f":"(C228-C226)/(A228-A226)*(A227-A226)+C226","v":195},{"$f":"(E227-C227)/(E219-C219)*(D219-C219)+C227","v":105},{"$f":"(E228-E226)/(A228-A226)*(A227-A226)+E226","v":285},{"$f":"(G227-E227)/(G219-E219)*(F219-E219)+E227","v":165},{"$f":"(G228-G226)/(A228-A226)*(A227-A226)+G226","v":345},{"$f":"(I227-G227)/(I219-G219)*(H219-G219)+G227","v":210},{"$f":"(I228-I226)/(A228-A226)*(A227-A226)+I226","v":390},{"$f":"(K227-I227)/(K219-I219)*(J219-I219)+I227","v":230},{"$f":"(K228-K226)/(A228-A226)*(A227-A226)+K226","v":430},{"$f":"(M227-K227)/(M219-K219)*(L219-K219)+K227","v":270},{"$f":"(M228-M226)/(A228-A226)*(A227-A226)+M226","v":510},{"$f":"(O227-M227)/(O219-M219)*(N219-M219)+M227","v":240},{"$f":"(O228-O226)/(A228-A226)*(A227-A226)+O226","v":600},{"$f":"(Q227-O227)/(Q219-O219)*(P219-O219)+O227","v":360},{"$f":"(Q228-Q226)/(A228-A226)*(A227-A226)+Q226","v":720}]
[6,null,435,{"$f":"(E228-C228)/(E219-C219)*(D219-C219)+C228","v":285},585,{"$f":"(G228-E228)/(G219-E219)*(F219-E219)+E228","v":385},685,{"$f":"(I228-G228)/(I219-G219)*(H219-G219)+G228","v":490},750,{"$f":"(K228-I228)/(K219-I219)*(J219-I219)+I228","v":510},810,{"$f":"(M228-K228)/(M219-K219)*(L219-K219)+K228","v":510},960,{"$f":"(O228-M228)/(O219-M219)*(N219-M219)+M228","v":750},1030,{"$f":"(Q228-O228)/(Q219-O219)*(P219-O219)+O228","v":590},1250]
[{"$f":"IF(AND(S226>A228,S226<A230)=TRUE,S226,0)","v":0},null,{"$f":"(C230-C228)/(A230-A228)*(A229-A228)+C228","v":60},{"$f":"(E229-C229)/(E219-C219)*(D219-C219)+C229","v":-50},{"$f":"(E230-E228)/(A230-A228)*(A229-A228)+E228","v":170},{"$f":"(G229-E229)/(G219-E219)*(F219-E219)+E229","v":20},{"$f":"(G230-G228)/(A230-A228)*(A229-A228)+G228","v":245},{"$f":"(I229-G229)/(I219-G219)*(H219-G219)+G229","v":155},{"$f":"(I230-I228)/(A230-A228)*(A229-A228)+I228","v":275},{"$f":"(K229-I229)/(K219-I219)*(J219-I219)+I229","v":615},{"$f":"(K230-K228)/(A230-A228)*(A229-A228)+K228","v":190},{"$f":"(M229-K229)/(M219-K219)*(L219-K219)+K229","v":480},{"$f":"(M230-M228)/(A230-A228)*(A229-A228)+M228","v":45},{"$f":"(O229-M229)/(O219-M219)*(N219-M219)+M229","v":375},{"$f":"(O230-O228)/(A230-A228)*(A229-A228)+O228","v":-65},{"$f":"(Q229-O229)/(Q219-O219)*(P219-O219)+O229","v":-195},{"$f":"(Q230-Q228)/(A230-A228)*(A229-A228)+Q228","v":0}]
[12,null,810,{"$f":"(E230-C230)/(E219-C219)*(D219-C219)+C230","v":620},1000,{"$f":"(G230-E230)/(G219-E219)*(F219-E219)+E230","v":750},1125,{"$f":"(I230-G230)/(I219-G219)*(H219-G219)+G230","v":825},1225,{"$f":"(K230-I230)/(K219-I219)*(J219-I219)+I230","v":405},1430,{"$f":"(M230-K230)/(M219-K219)*(L219-K219)+K230","v":540},1875,{"$f":"(O230-M230)/(O219-M219)*(N219-M219)+M230","v":1125},2125,{"$f":"(Q230-O230)/(Q219-O219)*(P219-O219)+O230","v":1375},2500]
[{"$f":"IF(AND(S226>A230,S226<A232)=TRUE,S226,0)","v":0},null,{"$f":"(C232-C230)/(A232-A230)*(A231-A230)+C230","v":60},{"$f":"(E231-C231)/(E219-C219)*(D219-C219)+C231","v":-70},{"$f":"(E232-E230)/(A232-A230)*(A231-A230)+E230","v":190},{"$f":"(G231-E231)/(G219-E219)*(F219-E219)+E231","v":30},{"$f":"(G232-G230)/(A232-A230)*(A231-A230)+G230","v":270},{"$f":"(I231-G231)/(I219-G219)*(H219-G219)+G231","v":240},{"$f":"(I232-I230)/(A232-A230)*(A231-A230)+I230","v":280},{"$f":"(K231-I231)/(K219-I219)*(J219-I219)+I231","v":600},{"$f":"(K232-K230)/(A232-A230)*(A231-A230)+K230","v":200},{"$f":"(M231-K231)/(M219-K219)*(L219-K219)+K231","v":510},{"$f":"(M232-M230)/(A232-A230)*(A231-A230)+M230","v":45},{"$f":"(O231-M231)/(O219-M219)*(N219-M219)+M231","v":375},{"$f":"(O232-O230)/(A232-A230)*(A231-A230)+O230","v":-65},{"$f":"(Q231-O231)/(Q219-O219)*(P219-O219)+O231","v":-395},{"$f":"(Q232-Q230)/(A232-A230)*(A231-A230)+Q230","v":100}]
[16,null,1060,{"$f":"(E232-C232)/(E219-C219)*(D219-C219)+C232","v":850},1270,{"$f":"(G232-E232)/(G219-E219)*(F219-E219)+E232","v":990},1410,{"$f":"(I232-G232)/(I219-G219)*(H219-G219)+G232","v":1020},1540,{"$f":"(K232-I232)/(K219-I219)*(J219-I219)+I232","v":340},1840,{"$f":"(M232-K232)/(M219-K219)*(L219-K219)+K232","v":550},2485,{"$f":"(O232-M232)/(O219-M219)*(N219-M219)+M232","v":1375},2855,{"$f":"(Q232-O232)/(Q219-O219)*(P219-O219)+O232","v":1965},3300]
[]
["COL",null,3,4,5,6,7,8,9,10,11,12,13,14,15,16,17]
[]
[]
[null,"DP",10,{"$f":"IF(AND(V244>C237,V244<E237)=TRUE,V244,0)","v":0},20,{"$f":"IF(AND(V244>E237,V244<G237)=TRUE,V244,0)","v":0},30,{"$f":"IF(AND(V244>G237,V244<I237)=TRUE,V244,0)","v":0},40,{"$f":"IF(AND(V244>I237,V244<K237)=TRUE,V244,0)","v":0},50,{"$f":"IF(AND(V244>K237,V244<M237)=TRUE,V244,0)","v":0},75,{"$f":"IF(AND(V244>M237,V244<O237)=TRUE,V244,0)","v":0},100,{"$f":"IF(AND(V244>O237,V244<Q237)=TRUE,V244,0)","v":0},150]
["PM"]
[]
[0.5,null,170,{"$f":"(E240-C240)/(E237-C237)*(D237-C237)+C240","v":70},270,{"$f":"(G240-E240)/(G237-E237)*(F237-E237)+E240","v":170},320,{"$f":"(I240-G240)/(I237-G237)*(H237-G237)+G240","v":170},370,{"$f":"(K240-I240)/(K237-I237)*(J237-I237)+I240","v":250},400,{"$f":"(M240-K240)/(M237-K237)*(L237-K237)+K240","v":179.99999999999997},510,{"$f":"(O240-M240)/(O237-M237)*(N237-M237)+M240","v":240},600,{"$f":"(Q240-O240)/(Q237-O237)*(P237-O237)+O240","v":380},710,null,"PM","Q","Qcal","DPcal","DP","TIPO"]
[{"$f":"IF(AND(S244>A240,S244<A242)=TRUE,S244,0)","v":0},null,{"$f":"(C242-C240)/(A242-A240)*(A241-A240)+C240","v":75},{"$f":"(E241-C241)/(E237-C237)*(D237-C237)+C241","v":-10},{"$f":"(E242-E240)/(A242-A240)*(A241-A240)+E240","v":160},{"$f":"(G241-E241)/(G237-E237)*(F237-E237)+E241","v":100},{"$f":"(G242-G240)/(A242-A240)*(A241-A240)+G240","v":190},{"$f":"(I241-G241)/(I237-G237)*(H237-G237)+G241","v":-110},{"$f":"(I242-I240)/(A242-A240)*(A241-A240)+I240","v":290},{"$f":"(K241-I241)/(K237-I237)*(J237-I237)+I241","v":530},{"$f":"(K242-K240)/(A242-A240)*(A241-A240)+K240","v":230},{"$f":"(M241-K241)/(M237-K237)*(L237-K237)+K241","v":-20},{"$f":"(M242-M240)/(A242-A240)*(A241-A240)+M240","v":355},{"$f":"(O241-M241)/(O237-M237)*(N237-M237)+M241","v":130},{"$f":"(O242-O240)/(A242-A240)*(A241-A240)+O240","v":430},{"$f":"(Q241-O241)/(Q237-O237)*(P237-O237)+O241","v":290},{"$f":"(Q242-Q240)/(A242-A240)*(A241-A240)+Q240","v":500}]
[1,null,265,{"$f":"(E242-C242)/(E237-C237)*(D237-C237)+C242","v":150},380,{"$f":"(G242-E242)/(G237-E237)*(F237-E237)+E242","v":240},450,{"$f":"(I242-G242)/(I237-G237)*(H237-G237)+G242","v":450},450,{"$f":"(K242-I242)/(K237-I237)*(J237-I237)+I242","v":-30},570,{"$f":"(M242-K242)/(M237-K237)*(L237-K237)+K242","v":380},665,{"$f":"(O242-M242)/(O237-M237)*(N237-M237)+M242","v":350},770,{"$f":"(Q242-O242)/(Q237-O237)*(P237-O237)+O242","v":470},920,null,null,"нм3/час","нм3/час","мбар","мбар"]
[{"$f":"IF(AND(S244>A242,S244<A244)=TRUE,S244,0)","v":0},null,{"$f":"(C244-C242)/(A244-A242)*(A243-A242)+C242","v":222.5},{"$f":"(E243-C243)/(E237-C237)*(D237-C237)+C243","v":125},{"$f":"(E244-E242)/(A244-A242)*(A243-A242)+E242","v":320},{"$f":"(G243-E243)/(G237-E237)*(F237-E237)+E243","v":195},{"$f":"(G244-G242)/(A244-A242)*(A243-A242)+G242","v":382.5},{"$f":"(I243-G243)/(I237-G237)*(H237-G237)+G243","v":382.5},{"$f":"(I244-I242)/(A244-A242)*(A243-A242)+I242","v":382.5},{"$f":"(K243-I243)/(K237-I237)*(J237-I237)+I243","v":-107.5},{"$f":"(K244-K242)/(A244-A242)*(A243-A242)+K242","v":505},{"$f":"(M243-K243)/(M237-K237)*(L237-K237)+K243","v":355},{"$f":"(M244-M242)/(A244-A242)*(A243-A242)+M242","v":580},{"$f":"(O243-M243)/(O237-M237)*(N237-M237)+M243","v":242.5},{"$f":"(O244-O242)/(A244-A242)*(A243-A242)+O242","v":692.5},{"$f":"(Q243-O243)/(Q237-O237)*(P237-O237)+O243","v":437.5},{"$f":"(Q244-Q242)/(A244-A242)*(A243-A242)+Q242","v":820}]
[3,null,350,{"$f":"(E244-C244)/(E237-C237)*(D237-C237)+C244","v":200},500,{"$f":"(G244-E244)/(G237-E237)*(F237-E237)+E244","v":330},585,{"$f":"(I244-G244)/(I237-G237)*(H237-G237)+G244","v":585},585,{"$f":"(K244-I244)/(K237-I237)*(J237-I237)+I244","v":125},700,{"$f":"(M244-K244)/(M237-K237)*(L237-K237)+K244","v":430},835,{"$f":"(O244-M244)/(O237-M237)*(N237-M237)+M244","v":565},925,{"$f":"(Q244-O244)/(Q237-O237)*(P237-O237)+O244","v":535},1120,null,{"$f":"Лист1!B17*10","v":0.1},{"$f":"Лист1!B19","v":3500},{"$f":"VLOOKUP(S244,A237:Q252,HLOOKUP(V244,A237:Q252,16,0),0)","v":{"$error":"#N/A"}},{"$f":"Лист1!B18*10","v":100},{"$f":"IF(S244<A240,\"NO\",IF(S244>A250,\"N0\",IF(VLOOKUP(S244,A240:Q250,3,0)>T244,\"NO\",IF(VLOOKUP(S244,A240:Q250,17,0)<T244,\"NO\",IF(AND(U244>=T244-0.1,U244<T244+0.1)=TRUE,V244,\"NO\")))))","v":"NO"},"Фильтр газовый",{"$f":"Лист1!F6","v":"РЕД-50 DN50"}]
[{"$f":"IF(AND(S244>A244,S244<A246)=TRUE,S244,0)","v":0},null,{"$f":"(C246-C244)/(A246-A244)*(A245-A244)+C244","v":205},{"$f":"(E245-C245)/(E237-C237)*(D237-C237)+C245","v":75},{"$f":"(E246-E244)/(A246-A244)*(A245-A244)+E244","v":335},{"$f":"(G245-E245)/(G237-E237)*(F237-E237)+E245","v":225},{"$f":"(G246-G244)/(A246-A244)*(A245-A244)+G244","v":390},{"$f":"(I245-G245)/(I237-G237)*(H237-G237)+G245","v":390},{"$f":"(I246-I244)/(A246-A244)*(A245-A244)+I244","v":390},{"$f":"(K245-I245)/(K237-I237)*(J237-I237)+I245","v":30},{"$f":"(K246-K244)/(A246-A244)*(A245-A244)+K244","v":480},{"$f":"(M245-K245)/(M237-K237)*(L237-K237)+K245","v":280},{"$f":"(M246-M244)/(A246-A244)*(A245-A244)+M244","v":580},{"$f":"(O245-M245)/(O237-M237)*(N237-M237)+M245","v":280},{"$f":"(O246-O244)/(A246-A244)*(A245-A244)+O244","v":680},{"$f":"(Q245-O245)/(Q237-O237)*(P237-O237)+O245","v":400},{"$f":"(Q246-Q244)/(A246-A244)*(A245-A244)+Q244","v":820}]
[6,null,495,{"$f":"(E246-C246)/(E237-C237)*(D237-C237)+C246","v":325},665,{"$f":"(G246-E246)/(G237-E237)*(F237-E237)+E246","v":435},780,{"$f":"(I246-G246)/(I237-G237)*(H237-G237)+G246","v":780},780,{"$f":"(K246-I246)/(K237-I237)*(J237-I237)+I246","v":220},920,{"$f":"(M246-K246)/(M237-K237)*(L237-K237)+K246","v":580},1090,{"$f":"(O246-M246)/(O237-M237)*(N237-M237)+M246","v":850},1170,{"$f":"(Q246-O246)/(Q237-O237)*(P237-O237)+O246","v":670},1420]
[{"$f":"IF(AND(S244>A246,S244<A248)=TRUE,S244,0)","v":0},null,{"$f":"(C248-C246)/(A248-A246)*(A247-A246)+C246","v":70},{"$f":"(E247-C247)/(E237-C237)*(D237-C237)+C247","v":-55},{"$f":"(E248-E246)/(A248-A246)*(A247-A246)+E246","v":195},{"$f":"(G247-E247)/(G237-E237)*(F237-E237)+E247","v":25},{"$f":"(G248-G246)/(A248-A246)*(A247-A246)+G246","v":280},{"$f":"(I247-G247)/(I237-G237)*(H237-G237)+G247","v":280},{"$f":"(I248-I246)/(A248-A246)*(A247-A246)+I246","v":280},{"$f":"(K247-I247)/(K237-I237)*(J237-I237)+I247","v":520},{"$f":"(K248-K246)/(A248-A246)*(A247-A246)+K246","v":220},{"$f":"(M247-K247)/(M237-K237)*(L237-K237)+K247","v":560},{"$f":"(M248-M246)/(A248-A246)*(A247-A246)+M246","v":50},{"$f":"(O247-M247)/(O237-M237)*(N237-M237)+M247","v":410},{"$f":"(O248-O246)/(A248-A246)*(A247-A246)+O246","v":-70},{"$f":"(Q247-O247)/(Q237-O237)*(P237-O237)+O247","v":-210},{"$f":"(Q248-Q246)/(A248-A246)*(A247-A246)+Q246","v":0}]
[12,null,920,{"$f":"(E248-C248)/(E237-C237)*(D237-C237)+C248","v":705},1135,{"$f":"(G248-E248)/(G237-E237)*(F237-E237)+E248","v":845},1280,{"$f":"(I248-G248)/(I237-G237)*(H237-G237)+G248","v":1280},1280,{"$f":"(K248-I248)/(K237-I237)*(J237-I237)+I248","v":-80},1620,{"$f":"(M248-K248)/(M237-K237)*(L237-K237)+K248","v":600.00000000000011},2130,{"$f":"(O248-M248)/(O237-M237)*(N237-M237)+M248","v":1290},2410,{"$f":"(Q248-O248)/(Q237-O237)*(P237-O237)+O248","v":1550},2840]
[{"$f":"IF(AND(S244>A248,S244<A250)=TRUE,S244,0)","v":0},null,{"$f":"(C250-C248)/(A250-A248)*(A249-A248)+C248","v":80},{"$f":"(E249-C249)/(E237-C237)*(D237-C237)+C249","v":-60},{"$f":"(E250-E248)/(A250-A248)*(A249-A248)+E248","v":220},{"$f":"(G249-E249)/(G237-E237)*(F237-E237)+E249","v":140},{"$f":"(G250-G248)/(A250-A248)*(A249-A248)+G248","v":260},{"$f":"(I249-G249)/(I237-G237)*(H237-G237)+G249","v":260},{"$f":"(I250-I248)/(A250-A248)*(A249-A248)+I248","v":260},{"$f":"(K249-I249)/(K237-I237)*(J237-I237)+I249","v":460},{"$f":"(K250-K248)/(A250-A248)*(A249-A248)+K248","v":210},{"$f":"(M249-K249)/(M237-K237)*(L237-K237)+K249","v":510},{"$f":"(M250-M248)/(A250-A248)*(A249-A248)+M248","v":60},{"$f":"(O249-M249)/(O237-M237)*(N237-M237)+M249","v":570},{"$f":"(O250-O248)/(A250-A248)*(A249-A248)+O248","v":-110},{"$f":"(Q249-O249)/(Q237-O237)*(P237-O237)+O249","v":-550},{"$f":"(Q250-Q248)/(A250-A248)*(A249-A248)+Q248","v":110}]
[16,null,1200,{"$f":"(E250-C250)/(E237-C237)*(D237-C237)+C250","v":960},1440,{"$f":"(G250-E250)/(G237-E237)*(F237-E237)+E250","v":1080},1620,{"$f":"(I250-G250)/(I237-G237)*(H237-G237)+G250","v":1620},1620,{"$f":"(K250-I250)/(K237-I237)*(J237-I237)+I250","v":-260},2090,{"$f":"(M250-K250)/(M237-K237)*(L237-K237)+K250","v":630},2820,{"$f":"(O250-M250)/(O237-M237)*(N237-M237)+M250","v":1530},3250,{"$f":"(Q250-O250)/(Q237-O237)*(P237-O237)+O250","v":2250},3750]
[]
["COL",null,3,4,5,6,7,8,9,10,11,12,13,14,15,16,17]

{"sheet":"РЕД-2","index":3,"n_rows":313,"n_cols":25,"rows_kept":313,"cut":false,"hidden":true,"merged":[]}
["Таблица расходов фильтров РЕД"]
[]
[]
[null,"DP",10,{"$f":"IF(AND(V11>C4,V11<E4)=TRUE,V11,0)","v":0},25,{"$f":"IF(AND(V11>E4,V11<G4)=TRUE,V11,0)","v":0},50,{"$f":"IF(AND(V11>G4,V11<I4)=TRUE,V11,0)","v":0},75,{"$f":"IF(AND(V11>I4,V11<K4)=TRUE,V11,0)","v":0},100,{"$f":"IF(AND(V11>K4,V11<M4)=TRUE,V11,0)","v":0},150,{"$f":"IF(AND(V11>M4,V11<O4)=TRUE,V11,0)","v":0},250,{"$f":"IF(AND(V11>O4,V11<Q4)=TRUE,V11,0)","v":0},500]
["PM"]
[]
[0.5,null,150,{"$f":"(E7-C7)/(E4-C4)*(D4-C4)+C7","v":103.33333333333333},220,{"$f":"(G7-E7)/(G4-E4)*(F4-E4)+E7","v":100},340,{"$f":"(I7-G7)/(I4-G4)*(H4-G4)+G7","v":220},400,{"$f":"(K7-I7)/(K4-I4)*(J4-I4)+I7","v":399.69999999999993},400.1,{"$f":"(M7-K7)/(M4-K4)*(L4-K4)+K7","v":399.90000000000009},400.2,{"$f":"(O7-M7)/(O4-M4)*(N4-M4)+M7","v":400.04999999999995},400.3,{"$f":"(Q7-O7)/(Q4-O4)*(P4-O4)+O7","v":400.20000000000005},400.4,null,"PM","Q","Qcal","DPcal","DP","TIPO"]
[{"$f":"IF(AND(S11>A7,S11<A9)=TRUE,S11,0)","v":0},null,{"$f":"(C9-C7)/(A9-A7)*(A8-A7)+C7","v":120},{"$f":"(E8-C8)/(E4-C4)*(D4-C4)+C8","v":93.333333333333343},{"$f":"(E9-E7)/(A9-A7)*(A8-A7)+E7","v":160},{"$f":"(G8-E8)/(G4-E4)*(F4-E4)+E8","v":40},{"$f":"(G9-G7)/(A9-A7)*(A8-A7)+G7","v":280},{"$f":"(I8-G8)/(I4-G4)*(H4-G4)+G8","v":140},{"$f":"(I9-I7)/(A9-A7)*(A8-A7)+I7","v":350},{"$f":"(K8-I8)/(K4-I4)*(J4-I4)+I8","v":349.69999999999993},{"$f":"(K9-K7)/(A9-A7)*(A8-A7)+K7","v":350.1},{"$f":"(M8-K8)/(M4-K4)*(L4-K4)+K8","v":349.90000000000009},{"$f":"(M9-M7)/(A9-A7)*(A8-A7)+M7","v":350.2},{"$f":"(O8-M8)/(O4-M4)*(N4-M4)+M8","v":350.04999999999995},{"$f":"(O9-O7)/(A9-A7)*(A8-A7)+O7","v":350.3},{"$f":"(Q8-O8)/(Q4-O4)*(P4-O4)+O8","v":350.20000000000005},{"$f":"(Q9-Q7)/(A9-A7)*(A8-A7)+Q7","v":350.4}]
[1,null,180,{"$f":"(E9-C9)/(E4-C4)*(D4-C4)+C9","v":113.33333333333333},280,{"$f":"(G9-E9)/(G4-E4)*(F4-E4)+E9","v":160},400,{"$f":"(I9-G9)/(I4-G4)*(H4-G4)+G9","v":300},450,{"$f":"(K9-I9)/(K4-I4)*(J4-I4)+I9","v":449.69999999999993},450.1,{"$f":"(M9-K9)/(M4-K4)*(L4-K4)+K9","v":449.90000000000009},450.2,{"$f":"(O9-M9)/(O4-M4)*(N4-M4)+M9","v":450.04999999999995},450.3,{"$f":"(Q9-O9)/(Q4-O4)*(P4-O4)+O9","v":450.20000000000005},450.4,null,null,"Stmc/h","Stmc/h","Mbar","Mbar"]
[{"$f":"IF(AND(S11>A9,S11<A11)=TRUE,S11,0)","v":0},null,{"$f":"(C11-C9)/(A11-A9)*(A10-A9)+C9","v":140},{"$f":"(E10-C10)/(E4-C4)*(D4-C4)+C10","v":86.666666666666671},{"$f":"(E11-E9)/(A11-A9)*(A10-A9)+E9","v":220},{"$f":"(G10-E10)/(G4-E4)*(F4-E4)+E10","v":140},{"$f":"(G11-G9)/(A11-A9)*(A10-A9)+G9","v":300},{"$f":"(I10-G10)/(I4-G4)*(H4-G4)+G10","v":300},{"$f":"(I11-I9)/(A11-A9)*(A10-A9)+I9","v":300},{"$f":"(K10-I10)/(K4-I4)*(J4-I4)+I10","v":599.39999999999986},{"$f":"(K11-K9)/(A11-A9)*(A10-A9)+K9","v":200.20000000000005},{"$f":"(M10-K10)/(M4-K4)*(L4-K4)+K10","v":200.00000000000023},{"$f":"(M11-M9)/(A11-A9)*(A10-A9)+M9","v":200.29999999999995},{"$f":"(O10-M10)/(O4-M4)*(N4-M4)+M10","v":200.14999999999992},{"$f":"(O11-O9)/(A11-A9)*(A10-A9)+O9","v":200.39999999999998},{"$f":"(Q10-O10)/(Q4-O4)*(P4-O4)+O10","v":200.29999999999995},{"$f":"(Q11-Q9)/(A11-A9)*(A10-A9)+Q9","v":200.5}]
[2,null,220,{"$f":"(E11-C11)/(E4-C4)*(D4-C4)+C11","v":140},340,{"$f":"(G11-E11)/(G4-E4)*(F4-E4)+E11","v":180},500,{"$f":"(I11-G11)/(I4-G4)*(H4-G4)+G11","v":300},600,{"$f":"(K11-I11)/(K4-I4)*(J4-I4)+I11","v":300},700,{"$f":"(M11-K11)/(M4-K4)*(L4-K4)+K11","v":699.8},700.1,{"$f":"(O11-M11)/(O4-M4)*(N4-M4)+M11","v":699.95},700.2,{"$f":"(Q11-O11)/(Q4-O4)*(P4-O4)+O11","v":700.10000000000014},700.3,null,{"$f":"Лист1!B17*10","v":0.1},{"$f":"DIMENSIONAMENTO!$D$12","v":3000},{"$f":"VLOOKUP(S11,A4:Q25,HLOOKUP(V11,A4:Q25,22,0),0)","v":{"$error":"#N/A"}},{"$f":"DIMENSIONAMENTO!$E$21","v":100},{"$f":"IF(S11<A7,\"NO\",IF(S11>A21,\"NO\",IF(VLOOKUP(S11,A7:Q21,3,0)>T11,\"NO\",IF(VLOOKUP(S11,A7:Q21,17,0)<T11,\"NO\",IF(AND(U11>=T11-0.1,U11<T11+0.1)=TRUE,V11,\"NO\")))))","v":"NO"},"FA-12-AP/","50-1"]
[{"$f":"IF(AND(S11>A11,S11<A13)=TRUE,S11,0)","v":0},null,{"$f":"(C13-C11)/(A13-A11)*(A12-A11)+C11","v":166.66666666666666},{"$f":"(E12-C12)/(E4-C4)*(D4-C4)+C12","v":77.777777777777771},{"$f":"(E13-E11)/(A13-A11)*(A12-A11)+E11","v":300},{"$f":"(G12-E12)/(G4-E4)*(F4-E4)+E12","v":233.33333333333337},{"$f":"(G13-G11)/(A13-A11)*(A12-A11)+G11","v":366.66666666666663},{"$f":"(I12-G12)/(I4-G4)*(H4-G4)+G12","v":99.999999999999886},{"$f":"(I13-I11)/(A13-A11)*(A12-A11)+I11","v":500},{"$f":"(K12-I12)/(K4-I4)*(J4-I4)+I12","v":500},{"$f":"(K13-K11)/(A13-A11)*(A12-A11)+K11","v":500},{"$f":"(M12-K12)/(M4-K4)*(L4-K4)+K12","v":766.33333333333326},{"$f":"(M13-M11)/(A13-A11)*(A12-A11)+M11","v":366.83333333333337},{"$f":"(O12-M12)/(O4-M4)*(N4-M4)+M12","v":366.68333333333328},{"$f":"(O13-O11)/(A13-A11)*(A12-A11)+O11","v":366.93333333333345},{"$f":"(Q12-O12)/(Q4-O4)*(P4-O4)+O12","v":366.83333333333366},{"$f":"(Q13-Q11)/(A13-A11)*(A12-A11)+Q11","v":367.03333333333325}]
[5,null,300,{"$f":"(E13-C13)/(E4-C4)*(D4-C4)+C13","v":233.33333333333331},400,{"$f":"(G13-E13)/(G4-E4)*(F4-E4)+E13","v":100},700,{"$f":"(I13-G13)/(I4-G4)*(H4-G4)+G13","v":600},750,{"$f":"(K13-I13)/(K4-I4)*(J4-I4)+I13","v":0},1000,{"$f":"(M13-K13)/(M4-K4)*(L4-K4)+K13","v":600},1200,{"$f":"(O13-M13)/(O4-M4)*(N4-M4)+M13","v":1199.8500000000001},1200.0999999999999,{"$f":"(Q13-O13)/(Q4-O4)*(P4-O4)+O13","v":1199.9999999999998},1200.2]
[{"$f":"IF(AND(S11>A13,S11<A15)=TRUE,S11,0)","v":0},null,{"$f":"(C15-C13)/(A15-A13)*(A14-A13)+C13","v":200},{"$f":"(E14-C14)/(E4-C4)*(D4-C4)+C14","v":133.33333333333331},{"$f":"(E15-E13)/(A15-A13)*(A14-A13)+E13","v":300},{"$f":"(G14-E14)/(G4-E4)*(F4-E4)+E14","v":-100},{"$f":"(G15-G13)/(A15-A13)*(A14-A13)+G13","v":700},{"$f":"(I14-G14)/(I4-G4)*(H4-G4)+G14","v":900},{"$f":"(I15-I13)/(A15-A13)*(A14-A13)+I13","v":600},{"$f":"(K14-I14)/(K4-I4)*(J4-I4)+I14","v":150},{"$f":"(K15-K13)/(A15-A13)*(A14-A13)+K13","v":750},{"$f":"(M14-K14)/(M4-K4)*(L4-K4)+K14","v":250},{"$f":"(M15-M13)/(A15-A13)*(A14-A13)+M13","v":1000},{"$f":"(O14-M14)/(O4-M4)*(N4-M4)+M14","v":2199.7000000000003},{"$f":"(O15-O13)/(A15-A13)*(A14-A13)+O13","v":200.19999999999982},{"$f":"(Q14-O14)/(Q4-O4)*(P4-O4)+O14","v":200.09999999999945},{"$f":"(Q15-Q13)/(A15-A13)*(A14-A13)+Q13","v":200.30000000000018}]
[10,null,400,{"$f":"(E15-C15)/(E4-C4)*(D4-C4)+C15","v":333.33333333333331},500,{"$f":"(G15-E15)/(G4-E4)*(F4-E4)+E15","v":300},700,{"$f":"(I15-G15)/(I4-G4)*(H4-G4)+G15","v":300},900,{"$f":"(K15-I15)/(K4-I4)*(J4-I4)+I15","v":-150},1250,{"$f":"(M15-K15)/(M4-K4)*(L4-K4)+K15","v":950},1400,{"$f":"(O15-M15)/(O4-M4)*(N4-M4)+M15","v":200},2200,{"$f":"(Q15-O15)/(Q4-O4)*(P4-O4)+O15","v":2199.9},2200.1]
[{"$f":"IF(AND(S11>A15,S11<A17)=TRUE,S11,0)","v":0},null,{"$f":"(C17-C15)/(A17-A15)*(A16-A15)+C15","v":266.66666666666663},{"$f":"(E16-C16)/(E4-C4)*(D4-C4)+C16","v":244.44444444444437},{"$f":"(E17-E15)/(A17-A15)*(A16-A15)+E15","v":300},{"$f":"(G16-E16)/(G4-E4)*(F4-E4)+E16","v":233.33333333333337},{"$f":"(G17-G15)/(A17-A15)*(A16-A15)+G15","v":366.66666666666663},{"$f":"(I16-G16)/(I4-G4)*(H4-G4)+G16","v":-3700.0000000000005},2400,{"$f":"(K16-I16)/(K4-I4)*(J4-I4)+I16","v":7150.0000000000009},{"$f":"(K17-K15)/(A17-A15)*(A16-A15)+K15","v":816.66666666666663},{"$f":"(M16-K16)/(M4-K4)*(L4-K4)+K16","v":716.66666666666663},{"$f":"(M17-M15)/(A17-A15)*(A16-A15)+M15","v":866.66666666666663},{"$f":"(O16-M16)/(O4-M4)*(N4-M4)+M16","v":-583.3333333333336},{"$f":"(O17-O15)/(A17-A15)*(A16-A15)+O15","v":1833.3333333333335},{"$f":"(Q16-O16)/(Q4-O4)*(P4-O4)+O16","v":2333.166666666667},{"$f":"(Q17-Q15)/(A17-A15)*(A16-A15)+Q15","v":1333.4999999999998}]
[25,null,600,{"$f":"(E17-C17)/(E4-C4)*(D4-C4)+C17","v":466.66666666666663},800,{"$f":"(G17-E17)/(G4-E4)*(F4-E4)+E17","v":400},1200,{"$f":"(I17-G17)/(I4-G4)*(H4-G4)+G17","v":600},1500,{"$f":"(K17-I17)/(K4-I4)*(J4-I4)+I17","v":300},1900,{"$f":"(M17-K17)/(M4-K4)*(L4-K4)+K17","v":1300},2200,{"$f":"(O17-M17)/(O4-M4)*(N4-M4)+M17","v":1375},2750,{"$f":"(Q17-O17)/(Q4-O4)*(P4-O4)+O17","v":2000},3500]
[{"$f":"IF(AND(S13>A17,S13<A19)=TRUE,S13,0)","v":0},null,{"$f":"(C19-C17)/(A19-A17)*(A18-A17)+C17","v":-400},{"$f":"(E18-C18)/(E4-C4)*(D4-C4)+C18","v":-422.22222222222234},{"$f":"(E19-E17)/(A19-A17)*(A18-A17)+E17","v":-366.66666666666652},{"$f":"(G18-E18)/(G4-E4)*(F4-E4)+E18","v":-766.66666666666652},{"$f":"(G19-G17)/(A19-A17)*(A18-A17)+G17","v":33.333333333333485},{"$f":"(I18-G18)/(I4-G4)*(H4-G4)+G18","v":-4700},2400,{"$f":"(K18-I18)/(K4-I4)*(J4-I4)+I18","v":7900.0000000000009},{"$f":"(K19-K17)/(A19-A17)*(A18-A17)+K17","v":566.66666666666652},{"$f":"(M18-K18)/(M4-K4)*(L4-K4)+K18","v":633.33333333333303},{"$f":"(M19-M17)/(A19-A17)*(A18-A17)+M17","v":533.33333333333326},{"$f":"(O18-M18)/(O4-M4)*(N4-M4)+M18","v":333.33333333333269},{"$f":"(O19-O17)/(A19-A17)*(A18-A17)+O17","v":666.66666666666697},{"$f":"(Q18-O18)/(Q4-O4)*(P4-O4)+O18","v":1166.6666666666674},{"$f":"(Q19-Q17)/(A19-A17)*(A18-A17)+Q17","v":166.66666666666652}]
[40,null,1200,{"$f":"(E19-C19)/(E4-C4)*(D4-C4)+C19","v":1000},1500,{"$f":"(G19-E19)/(G4-E4)*(F4-E4)+E19","v":1100},1900,{"$f":"(I19-G19)/(I4-G4)*(H4-G4)+G19","v":1100},2300,{"$f":"(K19-I19)/(K4-I4)*(J4-I4)+I19","v":1100},2700,{"$f":"(M19-K19)/(M4-K4)*(L4-K4)+K19","v":1700},3200,{"$f":"(O19-M19)/(O4-M4)*(N4-M4)+M19","v":2000},4000,{"$f":"(Q19-O19)/(Q4-O4)*(P4-O4)+O19","v":2500},5500]
[{"$f":"IF(AND(S15>A19,S15<A21)=TRUE,S15,0)","v":0},null,{"$f":"(C21-C19)/(A21-A19)*(A20-A19)+C19","v":666.66666666666663},{"$f":"(E20-C20)/(E8-C8)*(D8-C8)+C20","v":555.55555555555554},{"$f":"(E21-E19)/(A21-A19)*(A20-A19)+E19","v":833.33333333333326},{"$f":"(G20-E20)/(G8-E8)*(F8-E8)+E20","v":566.66666666666652},{"$f":"(G21-G19)/(A21-A19)*(A20-A19)+G19","v":1100},{"$f":"(I20-G20)/(I8-G8)*(H8-G8)+G20","v":-1500},2400,{"$f":"(K20-I20)/(K8-I8)*(J8-I8)+I20","v":6700.0000000000009},{"$f":"(K21-K19)/(A21-A19)*(A20-A19)+K19","v":966.66666666666652},{"$f":"(M20-K20)/(M8-K8)*(L8-K8)+K20","v":1299.9999999999995},{"$f":"(M21-M19)/(A21-A19)*(A20-A19)+M19","v":800},{"$f":"(O20-M20)/(O8-M8)*(N8-M8)+M20","v":0},{"$f":"(O21-O19)/(A21-A19)*(A20-A19)+O19","v":1333.333333333333},{"$f":"(Q20-O20)/(Q8-O8)*(P8-O8)+O20","v":-166.66666666666697},{"$f":"(Q21-Q19)/(A21-A19)*(A20-A19)+Q19","v":2833.333333333333}]
[70,null,1600,{"$f":"(E21-C21)/(E8-C8)*(D8-C8)+C21","v":1333.3333333333335},2000,{"$f":"(G21-E21)/(G8-E8)*(F8-E8)+E21","v":1500},2500,{"$f":"(I21-G21)/(I8-G8)*(H8-G8)+G21","v":1500},3000,{"$f":"(K21-I21)/(K8-I8)*(J8-I8)+I21","v":0},4000,{"$f":"(M21-K21)/(M8-K8)*(L8-K8)+K21","v":2000},5000,{"$f":"(O21-M21)/(O8-M8)*(N8-M8)+M21","v":3500},6000,{"$f":"(Q21-O21)/(Q8-O8)*(P8-O8)+O21","v":4500},7500,null,null,null,"VALORI LIMITE"]
[]
[]
[]
["COL",null,3,4,5,6,7,8,9,10,11,12,13,14,15,16,17]
[]
[]
[null,"DP",10,{"$f":"IF(AND(V35>C28,V35<E28)=TRUE,V35,0)","v":0},25,{"$f":"IF(AND(V35>E28,V35<G28)=TRUE,V35,0)","v":0},50,{"$f":"IF(AND(V35>G28,V35<I28)=TRUE,V35,0)","v":0},75,{"$f":"IF(AND(V35>I28,V35<K28)=TRUE,V35,0)","v":0},100,{"$f":"IF(AND(V35>K28,V35<M28)=TRUE,V35,0)","v":0},150,{"$f":"IF(AND(V35>M28,V35<O28)=TRUE,V35,0)","v":0},250,{"$f":"IF(AND(V35>O28,V35<Q28)=TRUE,V35,0)","v":0},500]
["PM"]
[]
[0.5,null,300,{"$f":"(E31-C31)/(E28-C28)*(D28-C28)+C31","v":266.66666666666669},350,{"$f":"(G31-E31)/(G28-E28)*(F28-E28)+E31","v":349.9},350.1,{"$f":"(I31-G31)/(I28-G28)*(H28-G28)+G31","v":349.90000000000009},350.2,{"$f":"(K31-I31)/(K28-I28)*(J28-I28)+I31","v":349.89999999999992},350.3,{"$f":"(M31-K31)/(M28-K28)*(L28-K28)+K31","v":350.10000000000008},350.4,{"$f":"(O31-M31)/(O28-M28)*(N28-M28)+M31","v":350.32499999999993},350.45,{"$f":"(Q31-O31)/(Q28-O28)*(P28-O28)+O31","v":350.40999999999997},350.49,null,"PM","Q","Qcal","DPcal","DP","TIPO"]
[{"$f":"IF(AND(S35>A31,S35<A33)=TRUE,S35,0)","v":0},null,{"$f":"(C33-C31)/(A33-A31)*(A32-A31)+C31","v":240},{"$f":"(E32-C32)/(E28-C28)*(D28-C28)+C32","v":233.33333333333334},{"$f":"(E33-E31)/(A33-A31)*(A32-A31)+E31","v":250},{"$f":"(G32-E32)/(G28-E28)*(F28-E28)+E32","v":249.89999999999998},{"$f":"(G33-G31)/(A33-A31)*(A32-A31)+G31","v":250.10000000000002},{"$f":"(I32-G32)/(I28-G28)*(H28-G28)+G32","v":249.90000000000009},{"$f":"(I33-I31)/(A33-A31)*(A32-A31)+I31","v":250.2},{"$f":"(K32-I32)/(K28-I28)*(J28-I28)+I32","v":249.89999999999992},{"$f":"(K33-K31)/(A33-A31)*(A32-A31)+K31","v":250.3},{"$f":"(M32-K32)/(M28-K28)*(L28-K28)+K32","v":250.10000000000008},{"$f":"(M33-M31)/(A33-A31)*(A32-A31)+M31","v":250.39999999999998},{"$f":"(O32-M32)/(O28-M28)*(N28-M28)+M32","v":250.32499999999996},{"$f":"(O33-O31)/(A33-A31)*(A32-A31)+O31","v":250.45},{"$f":"(Q32-O32)/(Q28-O28)*(P28-O28)+O32","v":250.40999999999997},{"$f":"(Q33-Q31)/(A33-A31)*(A32-A31)+Q31","v":250.49}]
[1,null,360,{"$f":"(E33-C33)/(E28-C28)*(D28-C28)+C33","v":300},450,{"$f":"(G33-E33)/(G28-E28)*(F28-E28)+E33","v":449.9},450.1,{"$f":"(I33-G33)/(I28-G28)*(H28-G28)+G33","v":449.90000000000009},450.2,{"$f":"(K33-I33)/(K28-I28)*(J28-I28)+I33","v":449.89999999999992},450.3,{"$f":"(M33-K33)/(M28-K28)*(L28-K28)+K33","v":450.10000000000008},450.4,{"$f":"(O33-M33)/(O28-M28)*(N28-M28)+M33","v":450.32499999999993},450.45,{"$f":"(Q33-O33)/(Q28-O28)*(P28-O28)+O33","v":450.40999999999997},450.49,null,null,"Stmc/h","Stmc/h","Mbar","Mbar"]
[{"$f":"IF(AND(S35>A33,S35<A35)=TRUE,S35,0)","v":0},null,{"$f":"(C35-C33)/(A35-A33)*(A34-A33)+C33","v":280},{"$f":"(E34-C34)/(E28-C28)*(D28-C28)+C34","v":333.33333333333331},{"$f":"(E35-E33)/(A35-A33)*(A34-A33)+E33","v":200},{"$f":"(G34-E34)/(G28-E28)*(F28-E28)+E34","v":199.89999999999998},{"$f":"(G35-G33)/(A35-A33)*(A34-A33)+G33","v":200.10000000000002},{"$f":"(I34-G34)/(I28-G28)*(H28-G28)+G34","v":199.9000000000002},{"$f":"(I35-I33)/(A35-A33)*(A34-A33)+I33","v":200.19999999999993},{"$f":"(K34-I34)/(K28-I28)*(J28-I28)+I34","v":199.89999999999952},{"$f":"(K35-K33)/(A35-A33)*(A34-A33)+K33","v":200.30000000000007},{"$f":"(M34-K34)/(M28-K28)*(L28-K28)+K34","v":200.10000000000025},{"$f":"(M35-M33)/(A35-A33)*(A34-A33)+M33","v":200.39999999999998},{"$f":"(O34-M34)/(O28-M28)*(N28-M28)+M34","v":200.32500000000005},{"$f":"(O35-O33)/(A35-A33)*(A34-A33)+O33","v":200.44999999999993},{"$f":"(Q34-O34)/(Q28-O28)*(P28-O28)+O34","v":200.40999999999985},{"$f":"(Q35-Q33)/(A35-A33)*(A34-A33)+Q33","v":200.49}]
[2,null,440,{"$f":"(E35-C35)/(E28-C28)*(D28-C28)+C35","v":266.66666666666669},700,{"$f":"(G35-E35)/(G28-E28)*(F28-E28)+E35","v":699.9},700.1,{"$f":"(I35-G35)/(I28-G28)*(H28-G28)+G35","v":699.9},700.2,{"$f":"(K35-I35)/(K28-I28)*(J28-I28)+I35","v":699.90000000000032},700.3,{"$f":"(M35-K35)/(M28-K28)*(L28-K28)+K35","v":700.09999999999991},700.4,{"$f":"(O35-M35)/(O28-M28)*(N28-M28)+M35","v":700.32499999999982},700.45,{"$f":"(Q35-O35)/(Q28-O28)*(P28-O28)+O35","v":700.41000000000008},700.49,null,{"$f":"Лист1!B17*10","v":0.1},{"$f":"DIMENSIONAMENTO!$D$12","v":3000},{"$f":"VLOOKUP(S35,A28:Q49,HLOOKUP(V35,A28:Q49,22,0),0)","v":{"$error":"#N/A"}},{"$f":"DIMENSIONAMENTO!$E$21","v":100},{"$f":"IF(S35<A31,\"NO\",IF(S35>A45,\"NO\",IF(VLOOKUP(S35,A31:Q45,3,0)>T35,\"NO\",IF(VLOOKUP(S35,A31:Q45,17,0)<T35,\"NO\",IF(AND(U35>=T35-0.1,U35<T35+0.1)=TRUE,V35,\"NO\")))))","v":"NO"},"FA-12-AP/",50]
[{"$f":"IF(AND(S35>A35,S35<A37)=TRUE,S35,0)","v":0},null,{"$f":"(C37-C35)/(A37-A35)*(A36-A35)+C35","v":300},{"$f":"(E36-C36)/(E28-C28)*(D28-C28)+C36","v":77.777777777777743},{"$f":"(E37-E35)/(A37-A35)*(A36-A35)+E35","v":633.33333333333337},{"$f":"(G36-E36)/(G28-E28)*(F28-E28)+E36","v":766.5},{"$f":"(G37-G35)/(A37-A35)*(A36-A35)+G35","v":500.16666666666674},{"$f":"(I36-G36)/(I28-G28)*(H28-G28)+G36","v":833.16666666666674},{"$f":"(I37-I35)/(A37-A35)*(A36-A35)+I35","v":333.66666666666674},{"$f":"(K36-I36)/(K28-I28)*(J28-I28)+I36","v":333.36666666666702},{"$f":"(K37-K35)/(A37-A35)*(A36-A35)+K35","v":333.76666666666665},{"$f":"(M36-K36)/(M28-K28)*(L28-K28)+K36","v":333.56666666666672},{"$f":"(M37-M35)/(A37-A35)*(A36-A35)+M35","v":333.86666666666662},{"$f":"(O36-M36)/(O28-M28)*(N28-M28)+M36","v":333.84166666666636},{"$f":"(O37-O35)/(A37-A35)*(A36-A35)+O35","v":333.88333333333344},{"$f":"(Q36-O36)/(Q28-O28)*(P28-O28)+O36","v":333.88333333333361},{"$f":"(Q37-Q35)/(A37-A35)*(A36-A35)+Q35","v":333.88333333333327}]
[5,null,650,{"$f":"(E37-C37)/(E28-C28)*(D28-C28)+C37","v":550},800,{"$f":"(G37-E37)/(G28-E28)*(F28-E28)+E37","v":600},1000,{"$f":"(I37-G37)/(I28-G28)*(H28-G28)+G37","v":500},1250,{"$f":"(K37-I37)/(K28-I28)*(J28-I28)+I37","v":1249.7000000000003},1250.0999999999999,{"$f":"(M37-K37)/(M28-K28)*(L28-K28)+K37","v":1249.8999999999996},1250.2,{"$f":"(O37-M37)/(O28-M28)*(N28-M28)+M37","v":1250.0500000000002},1250.3,{"$f":"(Q37-O37)/(Q28-O28)*(P28-O28)+O37","v":1250.1999999999998},1250.4000000000001]
[{"$f":"IF(AND(S35>A37,S35<A39)=TRUE,S35,0)","v":0},null,{"$f":"(C39-C37)/(A39-A37)*(A38-A37)+C37","v":400},{"$f":"(E38-C38)/(E28-C28)*(D28-C28)+C38","v":466.66666666666669},{"$f":"(E39-E37)/(A39-A37)*(A38-A37)+E37","v":300},{"$f":"(G38-E38)/(G28-E28)*(F28-E28)+E38","v":600},{"$f":"(G39-G37)/(A39-A37)*(A38-A37)+G37","v":0},{"$f":"(I38-G38)/(I28-G28)*(H28-G28)+G38","v":-200},{"$f":"(I39-I37)/(A39-A37)*(A38-A37)+I37","v":100},{"$f":"(K38-I38)/(K28-I28)*(J28-I28)+I38","v":399.40000000000055},{"$f":"(K39-K37)/(A39-A37)*(A38-A37)+K37","v":0.1999999999998181},{"$f":"(M38-K38)/(M28-K28)*(L28-K28)+K38","v":-9.0949470177292824E-13},{"$f":"(M39-M37)/(A39-A37)*(A38-A37)+M37","v":0.3000000000001819},{"$f":"(O38-M38)/(O28-M28)*(N28-M28)+M38","v":0.15000000000031832},{"$f":"(O39-O37)/(A39-A37)*(A38-A37)+O37","v":0.40000000000009095},{"$f":"(Q38-O38)/(Q28-O28)*(P28-O28)+O38","v":0.3000000000001819},{"$f":"(Q39-Q37)/(A39-A37)*(A38-A37)+Q37","v":0.5}]
[10,null,900,{"$f":"(E39-C39)/(E28-C28)*(D28-C28)+C39","v":633.33333333333326},1300,{"$f":"(G39-E39)/(G28-E28)*(F28-E28)+E39","v":600},2000,{"$f":"(I39-G39)/(I28-G28)*(H28-G28)+G39","v":1200},2400,{"$f":"(K39-I39)/(K28-I28)*(J28-I28)+I39","v":2100},2500,{"$f":"(M39-K39)/(M28-K28)*(L28-K28)+K39","v":2499.8000000000002},2500.1,{"$f":"(O39-M39)/(O28-M28)*(N28-M28)+M39","v":2499.9499999999998},2500.1999999999998,{"$f":"(Q39-O39)/(Q28-O28)*(P28-O28)+O39","v":2500.0999999999995},2500.3000000000002]
[{"$f":"IF(AND(S35>A39,S35<A41)=TRUE,S35,0)","v":0},null,{"$f":"(C41-C39)/(A41-A39)*(A40-A39)+C39","v":366.66666666666663},{"$f":"(E40-C40)/(E28-C28)*(D28-C28)+C40","v":55.555555555555429},{"$f":"(E41-E39)/(A41-A39)*(A40-A39)+E39","v":833.33333333333337},{"$f":"(G40-E40)/(G28-E28)*(F28-E28)+E40","v":333.33333333333348},{"$f":"(G41-G39)/(A41-A39)*(A40-A39)+G39","v":1333.3333333333333},{"$f":"(I40-G40)/(I28-G28)*(H28-G28)+G40","v":-800.00000000000023},2400,{"$f":"(K40-I40)/(K28-I28)*(J28-I28)+I40","v":5500},{"$f":"(K41-K39)/(A41-A39)*(A40-A39)+K39","v":1366.6666666666667},{"$f":"(M40-K40)/(M28-K28)*(L28-K28)+K40","v":2433},{"$f":"(M41-M39)/(A41-A39)*(A40-A39)+M39","v":833.5},{"$f":"(O40-M40)/(O28-M28)*(N28-M28)+M40","v":1333.2500000000005},{"$f":"(O41-O39)/(A41-A39)*(A40-A39)+O39","v":500.33333333333303},{"$f":"(Q40-O40)/(Q28-O28)*(P28-O28)+O40","v":500.23333333333267},{"$f":"(Q41-Q39)/(A41-A39)*(A40-A39)+Q39","v":500.43333333333339}]
[25,null,1700,{"$f":"(E41-C41)/(E28-C28)*(D28-C28)+C41","v":1500},2000,{"$f":"(G41-E41)/(G28-E28)*(F28-E28)+E41","v":1000},3000,{"$f":"(I41-G41)/(I28-G28)*(H28-G28)+G41","v":1800},3600,{"$f":"(K41-I41)/(K28-I28)*(J28-I28)+I41","v":1800},4200,{"$f":"(M41-K41)/(M28-K28)*(L28-K28)+K41","v":2600},5000,{"$f":"(O41-M41)/(O28-M28)*(N28-M28)+M41","v":4250},5500,{"$f":"(Q41-O41)/(Q28-O28)*(P28-O28)+O41","v":5499.9},5500.1]
[{"$f":"IF(AND(S37>A41,S37<A43)=TRUE,S37,0)","v":0},null,{"$f":"(C43-C41)/(A43-A41)*(A42-A41)+C41","v":1200},{"$f":"(E42-C42)/(E28-C28)*(D28-C28)+C42","v":1777.7777777777778},{"$f":"(E43-E41)/(A43-A41)*(A42-A41)+E41","v":333.33333333333326},{"$f":"(G42-E42)/(G28-E28)*(F28-E28)+E42","v":-666.66666666666674},{"$f":"(G43-G41)/(A43-A41)*(A42-A41)+G41","v":1333.3333333333333},{"$f":"(I42-G42)/(I28-G28)*(H28-G28)+G42","v":-800.00000000000023},2400,{"$f":"(K42-I42)/(K28-I28)*(J28-I28)+I42","v":6000},{"$f":"(K43-K41)/(A43-A41)*(A42-A41)+K41","v":1200},{"$f":"(M42-K42)/(M28-K28)*(L28-K28)+K42","v":266.66666666666697},{"$f":"(M43-M41)/(A43-A41)*(A42-A41)+M41","v":1666.6666666666665},{"$f":"(O42-M42)/(O28-M28)*(N28-M28)+M42","v":2166.6666666666652},{"$f":"(O43-O41)/(A43-A41)*(A42-A41)+O41","v":1333.3333333333339},{"$f":"(Q42-O42)/(Q28-O28)*(P28-O28)+O42","v":2999.7333333333336},{"$f":"(Q43-Q41)/(A43-A41)*(A42-A41)+Q41","v":-333.0666666666657}]
[40,null,2000,{"$f":"(E43-C43)/(E28-C28)*(D28-C28)+C43","v":1333.3333333333333},3000,{"$f":"(G43-E43)/(G28-E28)*(F28-E28)+E43","v":2000},4000,{"$f":"(I43-G43)/(I28-G28)*(H28-G28)+G43","v":2000},5000,{"$f":"(K43-I43)/(K28-I28)*(J28-I28)+I43","v":2000},6000,{"$f":"(M43-K43)/(M28-K28)*(L28-K28)+K43","v":4000},7000,{"$f":"(O43-M43)/(O28-M28)*(N28-M28)+M43","v":5500},8000,{"$f":"(Q43-O43)/(Q28-O28)*(P28-O28)+O43","v":7000},9000]
[{"$f":"IF(AND(S39>A43,S39<A45)=TRUE,S39,0)","v":0},null,{"$f":"(C45-C43)/(A45-A43)*(A44-A43)+C43","v":666.66666666666652},{"$f":"(E44-C44)/(E32-C32)*(D32-C32)+C44","v":0},{"$f":"(E45-E43)/(A45-A43)*(A44-A43)+E43","v":1666.6666666666665},{"$f":"(G44-E44)/(G32-E32)*(F32-E32)+E44","v":666.66666666666652},{"$f":"(G45-G43)/(A45-A43)*(A44-A43)+G43","v":2666.6666666666665},{"$f":"(I44-G44)/(I32-G32)*(H32-G32)+G44","v":3199.9999999999995},2400,{"$f":"(K44-I44)/(K32-I32)*(J32-I32)+I44","v":-2400},{"$f":"(K45-K43)/(A45-A43)*(A44-A43)+K43","v":4000},{"$f":"(M44-K44)/(M32-K32)*(L32-K32)+K44","v":3333.3333333333339},{"$f":"(M45-M43)/(A45-A43)*(A44-A43)+M43","v":4333.333333333333},{"$f":"(O44-M44)/(O32-M32)*(N32-M32)+M44","v":6833.3333333333339},{"$f":"(O45-O43)/(A45-A43)*(A44-A43)+O43","v":2666.6666666666661},{"$f":"(Q44-O44)/(Q32-O32)*(P32-O32)+O44","v":4333.3333333333321},{"$f":"(Q45-Q43)/(A45-A43)*(A44-A43)+Q43","v":1000}]
[70,null,3000,{"$f":"(E45-C45)/(E32-C32)*(D32-C32)+C45","v":2333.3333333333344},4000,{"$f":"(G45-E45)/(G32-E32)*(F32-E32)+E45","v":3000},5000,{"$f":"(I45-G45)/(I32-G32)*(H32-G32)+G45","v":3000},6000,{"$f":"(K45-I45)/(K32-I32)*(J32-I32)+I45","v":1500},7500,{"$f":"(M45-K45)/(M32-K32)*(L32-K32)+K45","v":4500},9000,{"$f":"(O45-M45)/(O32-M32)*(N32-M32)+M45","v":4500},12000,{"$f":"(Q45-O45)/(Q32-O32)*(P32-O32)+O45","v":9000},15000,null,null,null,"VALORI LIMITE"]
[]
[]
[]
["COL",null,3,4,5,6,7,8,9,10,11,12,13,14,15,16,17]
[]
[]
[null,"DP",10,{"$f":"IF(AND(V59>C52,V59<E52)=TRUE,V59,0)","v":0},25,{"$f":"IF(AND(V59>E52,V59<G52)=TRUE,V59,0)","v":0},50,{"$f":"IF(AND(V59>G52,V59<I52)=TRUE,V59,0)","v":0},75,{"$f":"IF(AND(V59>I52,V59<K52)=TRUE,V59,0)","v":0},100,{"$f":"IF(AND(V59>K52,V59<M52)=TRUE,V59,0)","v":0},150,{"$f":"IF(AND(V59>M52,V59<O52)=TRUE,V59,0)","v":0},250,{"$f":"IF(AND(V59>O52,V59<Q52)=TRUE,V59,0)","v":0},500]
["PM"]
[]
[0.5,null,300,{"$f":"(E55-C55)/(E52-C52)*(D52-C52)+C55","v":206.66666666666666},440,{"$f":"(G55-E55)/(G52-E52)*(F52-E52)+E55","v":280},600,{"$f":"(I55-G55)/(I52-G52)*(H52-G52)+G55","v":599.79999999999995},600.1,{"$f":"(K55-I55)/(K52-I52)*(J52-I52)+I55","v":599.79999999999995},600.20000000000005,{"$f":"(M55-K55)/(M52-K52)*(L52-K52)+K55","v":600.00000000000023},600.29999999999995,{"$f":"(O55-M55)/(O52-M52)*(N52-M52)+M55","v":600.14999999999986},600.4,{"$f":"(Q55-O55)/(Q52-O52)*(P52-O52)+O55","v":600.30999999999995},600.49,null,"PM","Q","Qcal","DPcal","DP","TIPO"]
[{"$f":"IF(AND(S59>A55,S59<A57)=TRUE,S59,0)","v":0},null,{"$f":"(C57-C55)/(A57-A55)*(A56-A55)+C55","v":240},{"$f":"(E56-C56)/(E52-C52)*(D52-C52)+C56","v":180},{"$f":"(E57-E55)/(A57-A55)*(A56-A55)+E55","v":330},{"$f":"(G56-E56)/(G52-E52)*(F52-E52)+E56","v":260},{"$f":"(G57-G55)/(A57-A55)*(A56-A55)+G55","v":400},{"$f":"(I56-G56)/(I52-G52)*(H52-G52)+G56","v":399.79999999999995},{"$f":"(I57-I55)/(A57-A55)*(A56-A55)+I55","v":400.1},{"$f":"(K56-I56)/(K52-I52)*(J52-I52)+I56","v":399.79999999999995},{"$f":"(K57-K55)/(A57-A55)*(A56-A55)+K55","v":400.20000000000005},{"$f":"(M56-K56)/(M52-K52)*(L52-K52)+K56","v":400.00000000000023},{"$f":"(M57-M55)/(A57-A55)*(A56-A55)+M55","v":400.29999999999995},{"$f":"(O56-M56)/(O52-M52)*(N52-M52)+M56","v":400.14999999999992},{"$f":"(O57-O55)/(A57-A55)*(A56-A55)+O55","v":400.4},{"$f":"(Q56-O56)/(Q52-O52)*(P52-O52)+O56","v":400.30999999999995},{"$f":"(Q57-Q55)/(A57-A55)*(A56-A55)+Q55","v":400.49}]
[1,null,360,{"$f":"(E57-C57)/(E52-C52)*(D52-C52)+C57","v":233.33333333333334},550,{"$f":"(G57-E57)/(G52-E52)*(F52-E52)+E57","v":300},800,{"$f":"(I57-G57)/(I52-G52)*(H52-G52)+G57","v":799.8},800.1,{"$f":"(K57-I57)/(K52-I52)*(J52-I52)+I57","v":799.8},800.2,{"$f":"(M57-K57)/(M52-K52)*(L52-K52)+K57","v":800.00000000000023},800.3,{"$f":"(O57-M57)/(O52-M52)*(N52-M52)+M57","v":800.14999999999986},800.4,{"$f":"(Q57-O57)/(Q52-O52)*(P52-O52)+O57","v":800.31},800.49,null,null,"Stmc/h","Stmc/h","Mbar","Mbar"]
[{"$f":"IF(AND(S59>A57,S59<A59)=TRUE,S59,0)","v":0},null,{"$f":"(C59-C57)/(A59-A57)*(A58-A57)+C57","v":280},{"$f":"(E58-C58)/(E52-C52)*(D52-C52)+C58","v":200},{"$f":"(E59-E57)/(A59-A57)*(A58-A57)+E57","v":400},{"$f":"(G58-E58)/(G52-E52)*(F52-E52)+E58","v":200},{"$f":"(G59-G57)/(A59-A57)*(A58-A57)+G57","v":600},{"$f":"(I58-G58)/(I52-G52)*(H52-G52)+G58","v":999.59999999999991},{"$f":"(I59-I57)/(A59-A57)*(A58-A57)+I57","v":400.20000000000005},{"$f":"(K58-I58)/(K52-I52)*(J52-I52)+I58","v":399.89999999999964},{"$f":"(K59-K57)/(A59-A57)*(A58-A57)+K57","v":400.30000000000018},{"$f":"(M58-K58)/(M52-K52)*(L52-K52)+K58","v":400.10000000000082},{"$f":"(M59-M57)/(A59-A57)*(A58-A57)+M57","v":400.39999999999986},{"$f":"(O58-M58)/(O52-M52)*(N52-M52)+M58","v":400.24999999999966},{"$f":"(O59-O57)/(A59-A57)*(A58-A57)+O57","v":400.5},{"$f":"(Q58-O58)/(Q52-O52)*(P52-O52)+O58","v":400.42000000000007},{"$f":"(Q59-Q57)/(A59-A57)*(A58-A57)+Q57","v":400.57999999999993}]
[2,null,440,{"$f":"(E59-C59)/(E52-C52)*(D52-C52)+C59","v":266.66666666666669},700,{"$f":"(G59-E59)/(G52-E52)*(F52-E52)+E59","v":400},1000,{"$f":"(I59-G59)/(I52-G52)*(H52-G52)+G59","v":600},1200,{"$f":"(K59-I59)/(K52-I52)*(J52-I52)+I59","v":1199.7000000000003},1200.0999999999999,{"$f":"(M59-K59)/(M52-K52)*(L52-K52)+K59","v":1199.8999999999996},1200.2,{"$f":"(O59-M59)/(O52-M52)*(N52-M52)+M59","v":1200.0500000000002},1200.3,{"$f":"(Q59-O59)/(Q52-O52)*(P52-O52)+O59","v":1200.1999999999998},1200.4000000000001,null,{"$f":"Лист1!B17*10","v":0.1},{"$f":"DIMENSIONAMENTO!$D$12","v":3000},{"$f":"VLOOKUP(S59,A52:Q73,HLOOKUP(V59,A52:Q73,22,0),0)","v":{"$error":"#N/A"}},{"$f":"DIMENSIONAMENTO!$E$21","v":100},{"$f":"IF(S59<A55,\"NO\",IF(S59>A69,\"NO\",IF(VLOOKUP(S59,A55:Q69,3,0)>T59,\"NO\",IF(VLOOKUP(S59,A55:Q69,17,0)<T59,\"NO\",IF(AND(U59>=T59-0.1,U59<T59+0.1)=TRUE,V59,\"NO\")))))","v":"NO"},"FA-12-AP/",65]
[{"$f":"IF(AND(S59>A59,S59<A61)=TRUE,S59,0)","v":0},null,{"$f":"(C61-C59)/(A61-A59)*(A60-A59)+C59","v":300},{"$f":"(E60-C60)/(E52-C52)*(D52-C52)+C60","v":166.66666666666666},{"$f":"(E61-E59)/(A61-A59)*(A60-A59)+E59","v":500},{"$f":"(G60-E60)/(G52-E52)*(F52-E52)+E60","v":266.66666666666674},{"$f":"(G61-G59)/(A61-A59)*(A60-A59)+G59","v":733.33333333333326},{"$f":"(I60-G60)/(I52-G52)*(H52-G52)+G60","v":466.66666666666629},{"$f":"(I61-I59)/(A61-A59)*(A60-A59)+I59","v":866.66666666666674},{"$f":"(K60-I60)/(K52-I52)*(J52-I52)+I60","v":1466.1666666666674},{"$f":"(K61-K59)/(A61-A59)*(A60-A59)+K59","v":666.83333333333314},{"$f":"(M60-K60)/(M52-K52)*(L52-K52)+K60","v":1199.8333333333326},{"$f":"(M61-M59)/(A61-A59)*(A60-A59)+M59","v":400.33333333333337},{"$f":"(O60-M60)/(O52-M52)*(N52-M52)+M60","v":400.18333333333351},{"$f":"(O61-O59)/(A61-A59)*(A60-A59)+O59","v":400.43333333333328},{"$f":"(Q60-O60)/(Q52-O52)*(P52-O52)+O60","v":400.33333333333292},{"$f":"(Q61-Q59)/(A61-A59)*(A60-A59)+Q59","v":400.53333333333364}]
[5,null,650,{"$f":"(E61-C61)/(E52-C52)*(D52-C52)+C61","v":416.66666666666669},1000,{"$f":"(G61-E61)/(G52-E52)*(F52-E52)+E61","v":600},1400,{"$f":"(I61-G61)/(I52-G52)*(H52-G52)+G61","v":800},1700,{"$f":"(K61-I61)/(K52-I52)*(J52-I52)+I61","v":800},2000,{"$f":"(M61-K61)/(M52-K52)*(L52-K52)+K61","v":1200},2400,{"$f":"(O61-M61)/(O52-M52)*(N52-M52)+M61","v":2399.8500000000004},2400.1,{"$f":"(Q61-O61)/(Q52-O52)*(P52-O52)+O61","v":2400},2400.1999999999998]
[{"$f":"IF(AND(S59>A61,S59<A63)=TRUE,S59,0)","v":0},null,{"$f":"(C63-C61)/(A63-A61)*(A62-A61)+C61","v":400},{"$f":"(E62-C62)/(E52-C52)*(D52-C52)+C62","v":200},{"$f":"(E63-E61)/(A63-A61)*(A62-A61)+E61","v":700},{"$f":"(G62-E62)/(G52-E52)*(F52-E52)+E62","v":600},{"$f":"(G63-G61)/(A63-A61)*(A62-A61)+G61","v":800},{"$f":"(I62-G62)/(I52-G52)*(H52-G52)+G62","v":400},{"$f":"(I63-I61)/(A63-A61)*(A62-A61)+I61","v":1000},{"$f":"(K62-I62)/(K52-I52)*(J52-I52)+I62","v":400},{"$f":"(K63-K61)/(A63-A61)*(A62-A61)+K61","v":1200},{"$f":"(M62-K62)/(M52-K52)*(L52-K52)+K62","v":400},{"$f":"(M63-M61)/(A63-A61)*(A62-A61)+M61","v":1600},{"$f":"(O62-M62)/(O52-M52)*(N52-M52)+M62","v":3399.7000000000003},{"$f":"(O63-O61)/(A63-A61)*(A62-A61)+O61","v":400.19999999999982},{"$f":"(Q62-O62)/(Q52-O52)*(P52-O52)+O62","v":400.10000000000036},{"$f":"(Q63-Q61)/(A63-A61)*(A62-A61)+Q61","v":400.29999999999927}]
[10,null,900,{"$f":"(E63-C63)/(E52-C52)*(D52-C52)+C63","v":633.33333333333326},1300,{"$f":"(G63-E63)/(G52-E52)*(F52-E52)+E63","v":600},2000,{"$f":"(I63-G63)/(I52-G52)*(H52-G52)+G63","v":1200},2400,{"$f":"(K63-I63)/(K52-I52)*(J52-I52)+I63","v":1200},2800,{"$f":"(M63-K63)/(M52-K52)*(L52-K52)+K63","v":2000},3200,{"$f":"(O63-M63)/(O52-M52)*(N52-M52)+M63","v":1400},4400,{"$f":"(Q63-O63)/(Q52-O52)*(P52-O52)+O63","v":4399.8999999999996},4400.1000000000004]
[{"$f":"IF(AND(S59>A63,S59<A65)=TRUE,S59,0)","v":0},null,{"$f":"(C65-C63)/(A65-A63)*(A64-A63)+C63","v":633.33333333333326},{"$f":"(E64-C64)/(E52-C52)*(D52-C52)+C64","v":499.99999999999989},{"$f":"(E65-E63)/(A65-A63)*(A64-A63)+E63","v":833.33333333333337},{"$f":"(G64-E64)/(G52-E52)*(F52-E52)+E64","v":333.33333333333348},{"$f":"(G65-G63)/(A65-A63)*(A64-A63)+G63","v":1333.3333333333333},{"$f":"(I64-G64)/(I52-G52)*(H52-G52)+G64","v":-800.00000000000023},2400,{"$f":"(K64-I64)/(K52-I52)*(J52-I52)+I64","v":3999.9999999999995},{"$f":"(K65-K63)/(A65-A63)*(A64-A63)+K63","v":1866.6666666666667},{"$f":"(M64-K64)/(M52-K52)*(L52-K52)+K64","v":1600.0000000000002},{"$f":"(M65-M63)/(A65-A63)*(A64-A63)+M63","v":2000},{"$f":"(O64-M64)/(O52-M52)*(N52-M52)+M64","v":400.00000000000045},{"$f":"(O65-O63)/(A65-A63)*(A64-A63)+O63","v":3066.6666666666665},{"$f":"(Q64-O64)/(Q52-O52)*(P52-O52)+O64","v":5466.4999999999991},{"$f":"(Q65-Q63)/(A65-A63)*(A64-A63)+Q63","v":666.83333333333394}]
[25,null,1300,{"$f":"(E65-C65)/(E52-C52)*(D52-C52)+C65","v":833.33333333333337},2000,{"$f":"(G65-E65)/(G52-E52)*(F52-E52)+E65","v":1000},3000,{"$f":"(I65-G65)/(I52-G52)*(H52-G52)+G65","v":1800},3600,{"$f":"(K65-I65)/(K52-I52)*(J52-I52)+I65","v":1800},4200,{"$f":"(M65-K65)/(M52-K52)*(L52-K52)+K65","v":2600},5000,{"$f":"(O65-M65)/(O52-M52)*(N52-M52)+M65","v":2900},6400,{"$f":"(Q65-O65)/(Q52-O52)*(P52-O52)+O65","v":2800},10000]
[{"$f":"IF(AND(S61>A65,S61<A67)=TRUE,S61,0)","v":0},null,{"$f":"(C67-C65)/(A67-A65)*(A66-A65)+C65","v":133.33333333333348},{"$f":"(E66-C66)/(E52-C52)*(D52-C52)+C66","v":3.1263880373444408E-13},{"$f":"(E67-E65)/(A67-A65)*(A66-A65)+E65","v":333.33333333333326},{"$f":"(G66-E66)/(G52-E52)*(F52-E52)+E66","v":-666.66666666666674},{"$f":"(G67-G65)/(A67-A65)*(A66-A65)+G65","v":1333.3333333333333},{"$f":"(I66-G66)/(I52-G52)*(H52-G52)+G66","v":-800.00000000000023},2400,{"$f":"(K66-I66)/(K52-I52)*(J52-I52)+I66","v":6000},{"$f":"(K67-K65)/(A67-A65)*(A66-A65)+K65","v":1200},{"$f":"(M66-K66)/(M52-K52)*(L52-K52)+K66","v":266.66666666666697},{"$f":"(M67-M65)/(A67-A65)*(A66-A65)+M65","v":1666.6666666666665},{"$f":"(O66-M66)/(O52-M52)*(N52-M52)+M66","v":-1433.333333333333},{"$f":"(O67-O65)/(A67-A65)*(A66-A65)+O65","v":3733.333333333333},{"$f":"(Q66-O66)/(Q52-O52)*(P52-O52)+O66","v":800},{"$f":"(Q67-Q65)/(A67-A65)*(A66-A65)+Q65","v":6666.6666666666661}]
[40,null,2000,{"$f":"(E67-C67)/(E52-C52)*(D52-C52)+C67","v":1333.3333333333333},3000,{"$f":"(G67-E67)/(G52-E52)*(F52-E52)+E67","v":2000},4000,{"$f":"(I67-G67)/(I52-G52)*(H52-G52)+G67","v":2000},5000,{"$f":"(K67-I67)/(K52-I52)*(J52-I52)+I67","v":2000},6000,{"$f":"(M67-K67)/(M52-K52)*(L52-K52)+K67","v":4000},7000,{"$f":"(O67-M67)/(O52-M52)*(N52-M52)+M67","v":5500},8000,{"$f":"(Q67-O67)/(Q52-O52)*(P52-O52)+O67","v":4000},12000]
[{"$f":"IF(AND(S63>A67,S63<A69)=TRUE,S63,0)","v":0},null,{"$f":"(C69-C67)/(A69-A67)*(A68-A67)+C67","v":666.66666666666652},{"$f":"(E68-C68)/(E56-C56)*(D56-C56)+C68","v":0},{"$f":"(E69-E67)/(A69-A67)*(A68-A67)+E67","v":1666.6666666666665},{"$f":"(G68-E68)/(G56-E56)*(F56-E56)+E68","v":666.66666666666652},{"$f":"(G69-G67)/(A69-A67)*(A68-A67)+G67","v":2666.6666666666665},{"$f":"(I68-G68)/(I56-G56)*(H56-G56)+G68","v":3199.9999999999995},2400,{"$f":"(K68-I68)/(K56-I56)*(J56-I56)+I68","v":-2400},{"$f":"(K69-K67)/(A69-A67)*(A68-A67)+K67","v":4000},{"$f":"(M68-K68)/(M56-K56)*(L56-K56)+K68","v":3333.3333333333339},{"$f":"(M69-M67)/(A69-A67)*(A68-A67)+M67","v":4333.333333333333},{"$f":"(O68-M68)/(O56-M56)*(N56-M56)+M68","v":6833.3333333333339},{"$f":"(O69-O67)/(A69-A67)*(A68-A67)+O67","v":2666.6666666666661},{"$f":"(Q68-O68)/(Q56-O56)*(P56-O56)+O68","v":-1333.3333333333335},{"$f":"(Q69-Q67)/(A69-A67)*(A68-A67)+Q67","v":6666.6666666666661}]
[70,null,3000,{"$f":"(E69-C69)/(E56-C56)*(D56-C56)+C69","v":2333.3333333333335},4000,{"$f":"(G69-E69)/(G56-E56)*(F56-E56)+E69","v":3000},5000,{"$f":"(I69-G69)/(I56-G56)*(H56-G56)+G69","v":3000},6000,{"$f":"(K69-I69)/(K56-I56)*(J56-I56)+I69","v":1500},7500,{"$f":"(M69-K69)/(M56-K56)*(L56-K56)+K69","v":4500},9000,{"$f":"(O69-M69)/(O56-M56)*(N56-M56)+M69","v":4500},12000,{"$f":"(Q69-O69)/(Q56-O56)*(P56-O56)+O69","v":8000},16000,null,null,null,"VALORI LIMITE"]
[]
[]
[]
["COL",null,3,4,5,6,7,8,9,10,11,12,13,14,15,16,17]
[]
[]
[null,"DP",10,{"$f":"IF(AND(V83>C76,V83<E76)=TRUE,V83,0)","v":0},25,{"$f":"IF(AND(V83>E76,V83<G76)=TRUE,V83,0)","v":0},50,{"$f":"IF(AND(V83>G76,V83<I76)=TRUE,V83,0)","v":0},75,{"$f":"IF(AND(V83>I76,V83<K76)=TRUE,V83,0)","v":0},100,{"$f":"IF(AND(V83>K76,V83<M76)=TRUE,V83,0)","v":0},150,{"$f":"IF(AND(V83>M76,V83<O76)=TRUE,V83,0)","v":0},250,{"$f":"IF(AND(V83>O76,V83<Q76)=TRUE,V83,0)","v":0},500]
["PM"]
[]
[0.5,null,600,{"$f":"(E79-C79)/(E76-C76)*(D76-C76)+C79","v":500},750,{"$f":"(G79-E79)/(G76-E76)*(F76-E76)+E79","v":749.9},750.1,{"$f":"(I79-G79)/(I76-G76)*(H76-G76)+G79","v":750.00000000000011},750.15,{"$f":"(K79-I79)/(K76-I76)*(J76-I76)+I79","v":749.99999999999977},750.2,{"$f":"(M79-K79)/(M76-K76)*(L76-K76)+K79","v":750.00000000000023},750.3,{"$f":"(O79-M79)/(O76-M76)*(N76-M76)+M79","v":750.14999999999986},750.4,{"$f":"(Q79-O79)/(Q76-O76)*(P76-O76)+O79","v":750.31},750.49,null,"PM","Q","Qcal","DPcal","DP","TIPO"]
[{"$f":"IF(AND(S83>A79,S83<A81)=TRUE,S83,0)","v":0},null,{"$f":"(C81-C79)/(A81-A79)*(A80-A79)+C79","v":500},{"$f":"(E80-C80)/(E76-C76)*(D76-C76)+C80","v":500},{"$f":"(E81-E79)/(A81-A79)*(A80-A79)+E79","v":500},{"$f":"(G80-E80)/(G76-E76)*(F76-E76)+E80","v":499.9},{"$f":"(G81-G79)/(A81-A79)*(A80-A79)+G79","v":500.1},{"$f":"(I80-G80)/(I76-G76)*(H76-G76)+G80","v":500.00000000000011},{"$f":"(I81-I79)/(A81-A79)*(A80-A79)+I79","v":500.15},{"$f":"(K80-I80)/(K76-I76)*(J76-I76)+I80","v":499.99999999999977},{"$f":"(K81-K79)/(A81-A79)*(A80-A79)+K79","v":500.20000000000005},{"$f":"(M80-K80)/(M76-K76)*(L76-K76)+K80","v":500.00000000000023},{"$f":"(M81-M79)/(A81-A79)*(A80-A79)+M79","v":500.29999999999995},{"$f":"(O80-M80)/(O76-M76)*(N76-M76)+M80","v":500.14999999999992},{"$f":"(O81-O79)/(A81-A79)*(A80-A79)+O79","v":500.4},{"$f":"(Q80-O80)/(Q76-O76)*(P76-O76)+O80","v":500.30999999999995},{"$f":"(Q81-Q79)/(A81-A79)*(A80-A79)+Q79","v":500.49}]
[1,null,700,{"$f":"(E81-C81)/(E76-C76)*(D76-C76)+C81","v":500},1000,{"$f":"(G81-E81)/(G76-E76)*(F76-E76)+E81","v":999.9},1000.1,{"$f":"(I81-G81)/(I76-G76)*(H76-G76)+G81","v":1000.0000000000001},1000.15,{"$f":"(K81-I81)/(K76-I76)*(J76-I76)+I81","v":999.99999999999977},1000.2,{"$f":"(M81-K81)/(M76-K76)*(L76-K76)+K81","v":1000.0000000000002},1000.3,{"$f":"(O81-M81)/(O76-M76)*(N76-M76)+M81","v":1000.1499999999999},1000.4,{"$f":"(Q81-O81)/(Q76-O76)*(P76-O76)+O81","v":1000.31},1000.49,null,null,"Stmc/h","Stmc/h","Mbar","Mbar"]
[{"$f":"IF(AND(S83>A81,S83<A83)=TRUE,S83,0)","v":0},null,{"$f":"(C83-C81)/(A83-A81)*(A82-A81)+C81","v":600},{"$f":"(E82-C82)/(E76-C76)*(D76-C76)+C82","v":533.33333333333337},{"$f":"(E83-E81)/(A83-A81)*(A82-A81)+E81","v":700},{"$f":"(G82-E82)/(G76-E76)*(F76-E76)+E82","v":1099.8},{"$f":"(G83-G81)/(A83-A81)*(A82-A81)+G81","v":300.20000000000005},{"$f":"(I82-G82)/(I76-G76)*(H76-G76)+G82","v":300.20000000000005},{"$f":"(I83-I81)/(A83-A81)*(A82-A81)+I81","v":300.20000000000005},{"$f":"(K82-I82)/(K76-I76)*(J76-I76)+I82","v":300.20000000000005},{"$f":"(K83-K81)/(A83-A81)*(A82-A81)+K81","v":300.20000000000005},{"$f":"(M82-K82)/(M76-K76)*(L76-K76)+K82","v":300.00000000000023},{"$f":"(M83-M81)/(A83-A81)*(A82-A81)+M81","v":300.29999999999995},{"$f":"(O82-M82)/(O76-M76)*(N76-M76)+M82","v":300.15000000000009},{"$f":"(O83-O81)/(A83-A81)*(A82-A81)+O81","v":300.39999999999986},{"$f":"(Q82-O82)/(Q76-O76)*(P76-O76)+O82","v":300.30999999999972},{"$f":"(Q83-Q81)/(A83-A81)*(A82-A81)+Q81","v":300.49}]
[2,null,800,{"$f":"(E83-C83)/(E76-C76)*(D76-C76)+C83","v":466.66666666666663},1300,{"$f":"(G83-E83)/(G76-E76)*(F76-E76)+E83","v":900},1700,{"$f":"(I83-G83)/(I76-G76)*(H76-G76)+G83","v":1699.8000000000002},1700.1,{"$f":"(K83-I83)/(K76-I76)*(J76-I76)+I83","v":1699.7999999999995},1700.2,{"$f":"(M83-K83)/(M76-K76)*(L76-K76)+K83","v":1700.0000000000002},1700.3,{"$f":"(O83-M83)/(O76-M76)*(N76-M76)+M83","v":1700.1499999999996},1700.4,{"$f":"(Q83-O83)/(Q76-O76)*(P76-O76)+O83","v":1700.3100000000002},1700.49,null,{"$f":"Лист1!B17*10","v":0.1},{"$f":"DIMENSIONAMENTO!$D$12","v":3000},{"$f":"VLOOKUP(S83,A76:Q97,HLOOKUP(V83,A76:Q97,22,0),0)","v":{"$error":"#N/A"}},{"$f":"DIMENSIONAMENTO!$E$21","v":100},{"$f":"IF(S83<A79,\"NO\",IF(S83>A93,\"NO\",IF(VLOOKUP(S83,A79:Q93,3,0)>T83,\"NO\",IF(VLOOKUP(S83,A79:Q93,17,0)<T83,\"NO\",IF(AND(U83>=T83-0.1,U83<T83+0.1)=TRUE,V83,\"NO\")))))","v":"NO"},"FA-12-AP/",80]
[{"$f":"IF(AND(S83>A83,S83<A85)=TRUE,S83,0)","v":0},null,{"$f":"(C85-C83)/(A85-A83)*(A84-A83)+C83","v":533.33333333333326},{"$f":"(E84-C84)/(E76-C76)*(D76-C76)+C84","v":244.44444444444423},{"$f":"(E85-E83)/(A85-A83)*(A84-A83)+E83","v":966.66666666666674},{"$f":"(G84-E84)/(G76-E76)*(F76-E76)+E84","v":833.33333333333348},{"$f":"(G85-G83)/(A85-A83)*(A84-A83)+G83","v":1100},{"$f":"(I84-G84)/(I76-G76)*(H76-G76)+G84","v":1633.0000000000002},{"$f":"(I85-I83)/(A85-A83)*(A84-A83)+I83","v":833.49999999999989},{"$f":"(K84-I84)/(K76-I76)*(J76-I76)+I84","v":833.19999999999914},{"$f":"(K85-K83)/(A85-A83)*(A84-A83)+K83","v":833.60000000000014},{"$f":"(M84-K84)/(M76-K76)*(L76-K76)+K84","v":833.40000000000032},{"$f":"(M85-M83)/(A85-A83)*(A84-A83)+M83","v":833.7},{"$f":"(O84-M84)/(O76-M76)*(N76-M76)+M84","v":833.55},{"$f":"(O85-O83)/(A85-A83)*(A84-A83)+O83","v":833.80000000000007},{"$f":"(Q84-O84)/(Q76-O76)*(P76-O76)+O84","v":833.71666666666681},{"$f":"(Q85-Q83)/(A85-A83)*(A84-A83)+Q83","v":833.88333333333333}]
[5,null,1200,{"$f":"(E85-C85)/(E76-C76)*(D76-C76)+C85","v":800},1800,{"$f":"(G85-E85)/(G76-E76)*(F76-E76)+E85","v":1000},2600,{"$f":"(I85-G85)/(I76-G76)*(H76-G76)+G85","v":1800},3000,{"$f":"(K85-I85)/(K76-I76)*(J76-I76)+I85","v":2999.7000000000003},3000.1,{"$f":"(M85-K85)/(M76-K76)*(L76-K76)+K85","v":2999.9},3000.2,{"$f":"(O85-M85)/(O76-M76)*(N76-M76)+M85","v":3000.0499999999993},3000.3,{"$f":"(Q85-O85)/(Q76-O76)*(P76-O76)+O85","v":3000.2000000000003},3000.4]
[{"$f":"IF(AND(S83>A85,S83<A87)=TRUE,S83,0)","v":0},null,{"$f":"(C87-C85)/(A87-A85)*(A86-A85)+C85","v":700},{"$f":"(E86-C86)/(E76-C76)*(D76-C76)+C86","v":366.66666666666663},{"$f":"(E87-E85)/(A87-A85)*(A86-A85)+E85","v":1200},{"$f":"(G86-E86)/(G76-E76)*(F76-E76)+E86","v":800},{"$f":"(G87-G85)/(A87-A85)*(A86-A85)+G85","v":1600},{"$f":"(I86-G86)/(I76-G76)*(H76-G76)+G86","v":1800},{"$f":"(I87-I85)/(A87-A85)*(A86-A85)+I85","v":1500},{"$f":"(K86-I86)/(K76-I76)*(J76-I76)+I86","v":2999.4000000000005},{"$f":"(K87-K85)/(A87-A85)*(A86-A85)+K85","v":1000.1999999999998},{"$f":"(M86-K86)/(M76-K76)*(L76-K76)+K86","v":1000.0000000000009},{"$f":"(M87-M85)/(A87-A85)*(A86-A85)+M85","v":1000.2999999999993},{"$f":"(O86-M86)/(O76-M76)*(N76-M76)+M86","v":1000.1499999999974},{"$f":"(O87-O85)/(A87-A85)*(A86-A85)+O85","v":1000.4000000000005},{"$f":"(Q86-O86)/(Q76-O76)*(P76-O76)+O86","v":1000.3000000000011},{"$f":"(Q87-Q85)/(A87-A85)*(A86-A85)+Q85","v":1000.5}]
[10,null,1700,{"$f":"(E87-C87)/(E76-C76)*(D76-C76)+C87","v":1233.3333333333335},2400,{"$f":"(G87-E87)/(G76-E76)*(F76-E76)+E87","v":1200},3600,{"$f":"(I87-G87)/(I76-G76)*(H76-G76)+G87","v":1800},4500,{"$f":"(K87-I87)/(K76-I76)*(J76-I76)+I87","v":3000},5000,{"$f":"(M87-K87)/(M76-K76)*(L76-K76)+K87","v":4999.7999999999993},5000.1000000000004,{"$f":"(O87-M87)/(O76-M76)*(N76-M76)+M87","v":4999.9500000000007},5000.2,{"$f":"(Q87-O87)/(Q76-O76)*(P76-O76)+O87","v":5000.0999999999995},5000.3]
[{"$f":"IF(AND(S83>A87,S83<A89)=TRUE,S83,0)","v":0},null,{"$f":"(C89-C87)/(A89-A87)*(A88-A87)+C87","v":1166.6666666666665},{"$f":"(E88-C88)/(E76-C76)*(D76-C76)+C88","v":1055.5555555555554},{"$f":"(E89-E87)/(A89-A87)*(A88-A87)+E87","v":1333.3333333333333},{"$f":"(G88-E88)/(G76-E76)*(F76-E76)+E88","v":666.66666666666652},{"$f":"(G89-G87)/(A89-A87)*(A88-A87)+G87","v":2000},{"$f":"(I88-G88)/(I76-G76)*(H76-G76)+G88","v":1200},2400,{"$f":"(K88-I88)/(K76-I76)*(J76-I76)+I88","v":600},{"$f":"(K89-K87)/(A89-A87)*(A88-A87)+K87","v":3000},{"$f":"(M88-K88)/(M76-K76)*(L76-K76)+K88","v":5666.3333333333321},{"$f":"(M89-M87)/(A89-A87)*(A88-A87)+M87","v":1666.8333333333339},{"$f":"(O88-M88)/(O76-M76)*(N76-M76)+M88","v":3666.5833333333358},{"$f":"(O89-O87)/(A89-A87)*(A88-A87)+O87","v":333.66666666666606},{"$f":"(Q88-O88)/(Q76-O76)*(P76-O76)+O88","v":1000.1666666666652},{"$f":"(Q89-Q87)/(A89-A87)*(A88-A87)+Q87","v":-332.83333333333303}]
[25,null,2500,{"$f":"(E89-C89)/(E76-C76)*(D76-C76)+C89","v":1500},4000,{"$f":"(G89-E89)/(G76-E76)*(F76-E76)+E89","v":2000},6000,{"$f":"(I89-G89)/(I76-G76)*(H76-G76)+G89","v":4000},7000,{"$f":"(K89-I89)/(K76-I76)*(J76-I76)+I89","v":4000},8000,{"$f":"(M89-K89)/(M76-K76)*(L76-K76)+K89","v":4000},10000,{"$f":"(O89-M89)/(O76-M76)*(N76-M76)+M89","v":7000},12000,{"$f":"(Q89-O89)/(Q76-O76)*(P76-O76)+O89","v":11000},13000]
[{"$f":"IF(AND(S85>A89,S85<A91)=TRUE,S85,0)","v":0},null,{"$f":"(C91-C89)/(A91-A89)*(A90-A89)+C89","v":833.33333333333326},{"$f":"(E90-C90)/(E76-C76)*(D76-C76)+C90","v":388.88888888888874},{"$f":"(E91-E89)/(A91-A89)*(A90-A89)+E89","v":1500},{"$f":"(G90-E90)/(G76-E76)*(F76-E76)+E90","v":-1333.333333333333},{"$f":"(G91-G89)/(A91-A89)*(A90-A89)+G89","v":4333.333333333333},{"$f":"(I90-G90)/(I76-G76)*(H76-G76)+G90","v":8199.9999999999982},2400,{"$f":"(K90-I90)/(K76-I76)*(J76-I76)+I90","v":-4399.9999999999982},{"$f":"(K91-K89)/(A91-A89)*(A90-A89)+K89","v":4666.6666666666661},{"$f":"(M90-K90)/(M76-K76)*(L76-K76)+K90","v":3999.9999999999982},{"$f":"(M91-M89)/(A91-A89)*(A90-A89)+M89","v":5000},{"$f":"(O90-M90)/(O76-M76)*(N76-M76)+M90","v":4500},{"$f":"(O91-O89)/(A91-A89)*(A90-A89)+O89","v":5333.333333333333},{"$f":"(Q90-O90)/(Q76-O76)*(P76-O76)+O90","v":11000},{"$f":"(Q91-Q89)/(A91-A89)*(A90-A89)+Q89","v":-333.33333333333394}]
[40,null,3500,{"$f":"(E91-C91)/(E76-C76)*(D76-C76)+C91","v":2166.6666666666665},5500,{"$f":"(G91-E91)/(G76-E76)*(F76-E76)+E91","v":4000},7000,{"$f":"(I91-G91)/(I76-G76)*(H76-G76)+G91","v":5000},8000,{"$f":"(K91-I91)/(K76-I76)*(J76-I76)+I91","v":2000},10000,{"$f":"(M91-K91)/(M76-K76)*(L76-K76)+K91","v":4000},13000,{"$f":"(O91-M91)/(O76-M76)*(N76-M76)+M91","v":8500},16000,{"$f":"(Q91-O91)/(Q76-O76)*(P76-O76)+O91","v":11000},21000]
[{"$f":"IF(AND(S87>A91,S87<A93)=TRUE,S87,0)","v":0},null,{"$f":"(C93-C91)/(A93-A91)*(A92-A91)+C91","v":1500},{"$f":"(E92-C92)/(E80-C80)*(D80-C80)+C92","v":{"$error":"#DIV/0!"}},{"$f":"(E93-E91)/(A93-A91)*(A92-A91)+E91","v":3500},{"$f":"(G92-E92)/(G80-E80)*(F80-E80)+E92","v":1333.3333333333339},{"$f":"(G93-G91)/(A93-A91)*(A92-A91)+G91","v":5666.6666666666661},{"$f":"(I92-G92)/(I80-G80)*(H80-G80)+G92","v":12199.999999999998},2400,{"$f":"(K92-I92)/(K80-I80)*(J80-I80)+I92","v":-8400},{"$f":"(K93-K91)/(A93-A91)*(A92-A91)+K91","v":6000},{"$f":"(M92-K92)/(M80-K80)*(L80-K80)+K92","v":0},{"$f":"(M93-M91)/(A93-A91)*(A92-A91)+M91","v":9000},{"$f":"(O92-M92)/(O80-M80)*(N80-M80)+M92","v":8500},{"$f":"(O93-O91)/(A93-A91)*(A92-A91)+O91","v":9333.3333333333339},{"$f":"(Q92-O92)/(Q80-O80)*(P80-O80)+O92","v":9666.6666666666679},{"$f":"(Q93-Q91)/(A93-A91)*(A92-A91)+Q91","v":9000}]
[70,null,5000,{"$f":"(E93-C93)/(E80-C80)*(D80-C80)+C93","v":{"$error":"#DIV/0!"}},7000,{"$f":"(G93-E93)/(G80-E80)*(F80-E80)+E93","v":6000},8000,{"$f":"(I93-G93)/(I80-G80)*(H80-G80)+G93","v":4000},10000,{"$f":"(K93-I93)/(K80-I80)*(J80-I80)+I93","v":1000},13000,{"$f":"(M93-K93)/(M80-K80)*(L80-K80)+K93","v":7000},16000,{"$f":"(O93-M93)/(O80-M80)*(N80-M80)+M93","v":8500},21000,{"$f":"(Q93-O93)/(Q80-O80)*(P80-O80)+O93","v":12000},30000,null,null,null,"VALORI LIMITE"]
[]
[]
[]
["COL",null,3,4,5,6,7,8,9,10,11,12,13,14,15,16,17]
[]
[]
[null,"DP",10,{"$f":"IF(AND(V107>C100,V107<E100)=TRUE,V107,0)","v":0},25,{"$f":"IF(AND(V107>E100,V107<G100)=TRUE,V107,0)","v":0},50,{"$f":"IF(AND(V107>G100,V107<I100)=TRUE,V107,0)","v":0},75,{"$f":"IF(AND(V107>I100,V107<K100)=TRUE,V107,0)","v":0},100,{"$f":"IF(AND(V107>K100,V107<M100)=TRUE,V107,0)","v":0},150,{"$f":"IF(AND(V107>M100,V107<O100)=TRUE,V107,0)","v":0},250,{"$f":"IF(AND(V107>O100,V107<Q100)=TRUE,V107,0)","v":0},500]
["PM"]
[]
[0.5,null,600,{"$f":"(E103-C103)/(E100-C100)*(D100-C100)+C103","v":400},900,{"$f":"(G103-E103)/(G100-E100)*(F100-E100)+E103","v":500},1300,{"$f":"(I103-G103)/(I100-G100)*(H100-G100)+G103","v":1300},1300,{"$f":"(K103-I103)/(K100-I100)*(J100-I100)+I103","v":1299.7000000000003},1300.0999999999999,{"$f":"(M103-K103)/(M100-K100)*(L100-K100)+K103","v":1299.8999999999996},1300.2,{"$f":"(O103-M103)/(O100-M100)*(N100-M100)+M103","v":1300.0500000000002},1300.3,{"$f":"(Q103-O103)/(Q100-O100)*(P100-O100)+O103","v":1300.1999999999998},1300.4000000000001,null,"PM","Q","Qcal","DPcal","DP","TIPO"]
[{"$f":"IF(AND(S107>A103,S107<A105)=TRUE,S107,0)","v":0},null,{"$f":"(C105-C103)/(A105-A103)*(A104-A103)+C103","v":500},{"$f":"(E104-C104)/(E100-C100)*(D100-C100)+C104","v":300},{"$f":"(E105-E103)/(A105-A103)*(A104-A103)+E103","v":800},{"$f":"(G104-E104)/(G100-E100)*(F100-E100)+E104","v":500},{"$f":"(G105-G103)/(A105-A103)*(A104-A103)+G103","v":1100},{"$f":"(I104-G104)/(I100-G100)*(H100-G100)+G104","v":1900},{"$f":"(I105-I103)/(A105-A103)*(A104-A103)+I103","v":700},{"$f":"(K104-I104)/(K100-I100)*(J100-I100)+I104","v":699.70000000000027},{"$f":"(K105-K103)/(A105-A103)*(A104-A103)+K103","v":700.09999999999991},{"$f":"(M104-K104)/(M100-K100)*(L100-K100)+K104","v":699.89999999999964},{"$f":"(M105-M103)/(A105-A103)*(A104-A103)+M103","v":700.2},{"$f":"(O104-M104)/(O100-M100)*(N100-M100)+M104","v":700.05000000000018},{"$f":"(O105-O103)/(A105-A103)*(A104-A103)+O103","v":700.3},{"$f":"(Q104-O104)/(Q100-O100)*(P100-O100)+O104","v":700.19999999999982},{"$f":"(Q105-Q103)/(A105-A103)*(A104-A103)+Q103","v":700.40000000000009}]
[1,null,700,{"$f":"(E105-C105)/(E100-C100)*(D100-C100)+C105","v":500},1000,{"$f":"(G105-E105)/(G100-E100)*(F100-E100)+E105","v":500},1500,{"$f":"(I105-G105)/(I100-G100)*(H100-G100)+G105","v":700},1900,{"$f":"(K105-I105)/(K100-I100)*(J100-I100)+I105","v":1899.7000000000003},1900.1,{"$f":"(M105-K105)/(M100-K100)*(L100-K100)+K105","v":1899.8999999999996},1900.2,{"$f":"(O105-M105)/(O100-M100)*(N100-M100)+M105","v":1900.0500000000002},1900.3,{"$f":"(Q105-O105)/(Q100-O100)*(P100-O100)+O105","v":1900.1999999999998},1900.4,null,null,"Stmc/h","Stmc/h","Mbar","Mbar"]
[{"$f":"IF(AND(S107>A105,S107<A107)=TRUE,S107,0)","v":0},null,{"$f":"(C107-C105)/(A107-A105)*(A106-A105)+C105","v":600},{"$f":"(E106-C106)/(E100-C100)*(D100-C100)+C106","v":533.33333333333337},{"$f":"(E107-E105)/(A107-A105)*(A106-A105)+E105","v":700},{"$f":"(G106-E106)/(G100-E100)*(F100-E100)+E106","v":100},{"$f":"(G107-G105)/(A107-A105)*(A106-A105)+G105","v":1300},{"$f":"(I106-G106)/(I100-G100)*(H100-G100)+G106","v":700},{"$f":"(I107-I105)/(A107-A105)*(A106-A105)+I105","v":1600},{"$f":"(K106-I106)/(K100-I100)*(J100-I100)+I106","v":2799.4000000000005},{"$f":"(K107-K105)/(A107-A105)*(A106-A105)+K105","v":1200.1999999999998},{"$f":"(M106-K106)/(M100-K100)*(L100-K100)+K106","v":1199.9999999999991},{"$f":"(M107-M105)/(A107-A105)*(A106-A105)+M105","v":1200.3000000000002},{"$f":"(O106-M106)/(O100-M100)*(N100-M100)+M106","v":1200.1500000000003},{"$f":"(O107-O105)/(A107-A105)*(A106-A105)+O105","v":1200.4000000000001},{"$f":"(Q106-O106)/(Q100-O100)*(P100-O100)+O106","v":1200.3000000000002},{"$f":"(Q107-Q105)/(A107-A105)*(A106-A105)+Q105","v":1200.5}]
[2,null,800,{"$f":"(E107-C107)/(E100-C100)*(D100-C100)+C107","v":466.66666666666663},1300,{"$f":"(G107-E107)/(G100-E100)*(F100-E100)+E107","v":900},1700,{"$f":"(I107-G107)/(I100-G100)*(H100-G100)+G107","v":700},2200,{"$f":"(K107-I107)/(K100-I100)*(J100-I100)+I107","v":1000},2600,{"$f":"(M107-K107)/(M100-K100)*(L100-K100)+K107","v":2599.8000000000002},2600.1,{"$f":"(O107-M107)/(O100-M100)*(N100-M100)+M107","v":2599.9499999999998},2600.1999999999998,{"$f":"(Q107-O107)/(Q100-O100)*(P100-O100)+O107","v":2600.0999999999995},2600.3000000000002,null,{"$f":"Лист1!B17*10","v":0.1},{"$f":"DIMENSIONAMENTO!$D$12","v":3000},{"$f":"VLOOKUP(S107,A100:Q121,HLOOKUP(V107,A100:Q121,22,0),0)","v":{"$error":"#N/A"}},{"$f":"DIMENSIONAMENTO!$E$21","v":100},{"$f":"IF(S107<A103,\"NO\",IF(S107>A117,\"NO\",IF(VLOOKUP(S107,A103:Q117,3,0)>T107,\"NO\",IF(VLOOKUP(S107,A103:Q117,17,0)<T107,\"NO\",IF(AND(U107>=T107-0.1,U107<T107+0.1)=TRUE,V107,\"NO\")))))","v":"NO"},"FA-12-AP/",100]
[{"$f":"IF(AND(S107>A107,S107<A109)=TRUE,S107,0)","v":0},null,{"$f":"(C109-C107)/(A109-A107)*(A108-A107)+C107","v":533.33333333333326},{"$f":"(E108-C108)/(E100-C100)*(D100-C100)+C108","v":244.44444444444423},{"$f":"(E109-E107)/(A109-A107)*(A108-A107)+E107","v":966.66666666666674},{"$f":"(G108-E108)/(G100-E100)*(F100-E100)+E108","v":833.33333333333348},{"$f":"(G109-G107)/(A109-A107)*(A108-A107)+G107","v":1100},{"$f":"(I108-G108)/(I100-G100)*(H100-G100)+G108","v":233.33333333333303},{"$f":"(I109-I107)/(A109-A107)*(A108-A107)+I107","v":1533.3333333333335},{"$f":"(K108-I108)/(K100-I100)*(J100-I100)+I108","v":133.33333333333394},{"$f":"(K109-K107)/(A109-A107)*(A108-A107)+K107","v":2000},{"$f":"(M108-K108)/(M100-K100)*(L100-K100)+K108","v":3333.0000000000005},{"$f":"(M109-M107)/(A109-A107)*(A108-A107)+M107","v":1333.4999999999998},{"$f":"(O108-M108)/(O100-M100)*(N100-M100)+M108","v":1333.3500000000004},{"$f":"(O109-O107)/(A109-A107)*(A108-A107)+O107","v":1333.5999999999995},{"$f":"(Q108-O108)/(Q100-O100)*(P100-O100)+O108","v":1333.4999999999984},{"$f":"(Q109-Q107)/(A109-A107)*(A108-A107)+Q107","v":1333.7000000000005}]
[5,null,1200,{"$f":"(E109-C109)/(E100-C100)*(D100-C100)+C109","v":800},1800,{"$f":"(G109-E109)/(G100-E100)*(F100-E100)+E109","v":1000},2600,{"$f":"(I109-G109)/(I100-G100)*(H100-G100)+G109","v":1400},3200,{"$f":"(K109-I109)/(K100-I100)*(J100-I100)+I109","v":2300},3500,{"$f":"(M109-K109)/(M100-K100)*(L100-K100)+K109","v":1500},4500,{"$f":"(O109-M109)/(O100-M100)*(N100-M100)+M109","v":4499.8499999999995},4500.1000000000004,{"$f":"(Q109-O109)/(Q100-O100)*(P100-O100)+O109","v":4500.0000000000009},4500.2]
[{"$f":"IF(AND(S107>A109,S107<A111)=TRUE,S107,0)","v":0},null,{"$f":"(C111-C109)/(A111-A109)*(A110-A109)+C109","v":700},{"$f":"(E110-C110)/(E100-C100)*(D100-C100)+C110","v":366.66666666666663},{"$f":"(E111-E109)/(A111-A109)*(A110-A109)+E109","v":1200},{"$f":"(G110-E110)/(G100-E100)*(F100-E100)+E110","v":800},{"$f":"(G111-G109)/(A111-A109)*(A110-A109)+G109","v":1600},{"$f":"(I110-G110)/(I100-G100)*(H100-G100)+G110","v":1000},{"$f":"(I111-I109)/(A111-A109)*(A110-A109)+I109","v":1900},{"$f":"(K110-I110)/(K100-I100)*(J100-I100)+I110","v":1600},{"$f":"(K111-K109)/(A111-A109)*(A110-A109)+K109","v":2000},{"$f":"(M110-K110)/(M100-K100)*(L100-K100)+K110","v":0},{"$f":"(M111-M109)/(A111-A109)*(A110-A109)+M109","v":3000},{"$f":"(O110-M110)/(O100-M100)*(N100-M100)+M110","v":5999.6999999999989},{"$f":"(O111-O109)/(A111-A109)*(A110-A109)+O109","v":1000.2000000000007},{"$f":"(Q110-O110)/(Q100-O100)*(P100-O100)+O110","v":1000.2000000000016},{"$f":"(Q111-Q109)/(A111-A109)*(A110-A109)+Q109","v":1000.1999999999998}]
[10,null,1700,{"$f":"(E111-C111)/(E100-C100)*(D100-C100)+C111","v":1233.3333333333335},2400,{"$f":"(G111-E111)/(G100-E100)*(F100-E100)+E111","v":1200},3600,{"$f":"(I111-G111)/(I100-G100)*(H100-G100)+G111","v":1800},4500,{"$f":"(K111-I111)/(K100-I100)*(J100-I100)+I111","v":3000},5000,{"$f":"(M111-K111)/(M100-K100)*(L100-K100)+K111","v":3000},6000,{"$f":"(O111-M111)/(O100-M100)*(N100-M100)+M111","v":3000},8000,{"$f":"(Q111-O111)/(Q100-O100)*(P100-O100)+O111","v":7999.8},8000.2]
[{"$f":"IF(AND(S107>A111,S107<A113)=TRUE,S107,0)","v":0},null,{"$f":"(C113-C111)/(A113-A111)*(A112-A111)+C111","v":1166.6666666666665},{"$f":"(E112-C112)/(E100-C100)*(D100-C100)+C112","v":1055.5555555555554},{"$f":"(E113-E111)/(A113-A111)*(A112-A111)+E111","v":1333.3333333333333},{"$f":"(G112-E112)/(G100-E100)*(F100-E100)+E112","v":666.66666666666652},{"$f":"(G113-G111)/(A113-A111)*(A112-A111)+G111","v":2000},{"$f":"(I112-G112)/(I100-G100)*(H100-G100)+G112","v":1200},2400,{"$f":"(K112-I112)/(K100-I100)*(J100-I100)+I112","v":600},{"$f":"(K113-K111)/(A113-A111)*(A112-A111)+K111","v":3000},{"$f":"(M112-K112)/(M100-K100)*(L100-K100)+K112","v":2333.3333333333339},{"$f":"(M113-M111)/(A113-A111)*(A112-A111)+M111","v":3333.333333333333},{"$f":"(O112-M112)/(O100-M100)*(N100-M100)+M112","v":333.33333333333303},{"$f":"(O113-O111)/(A113-A111)*(A112-A111)+O111","v":5333.333333333333},{"$f":"(Q112-O112)/(Q100-O100)*(P100-O100)+O112","v":8999.6666666666642},{"$f":"(Q113-Q111)/(A113-A111)*(A112-A111)+Q111","v":1667.0000000000009}]
[25,null,2500,{"$f":"(E113-C113)/(E100-C100)*(D100-C100)+C113","v":1500},4000,{"$f":"(G113-E113)/(G100-E100)*(F100-E100)+E113","v":2000},6000,{"$f":"(I113-G113)/(I100-G100)*(H100-G100)+G113","v":4000},7000,{"$f":"(K113-I113)/(K100-I100)*(J100-I100)+I113","v":4000},8000,{"$f":"(M113-K113)/(M100-K100)*(L100-K100)+K113","v":4000},10000,{"$f":"(O113-M113)/(O100-M100)*(N100-M100)+M113","v":7000},12000,{"$f":"(Q113-O113)/(Q100-O100)*(P100-O100)+O113","v":6500},17500]
[{"$f":"IF(AND(S109>A113,S109<A115)=TRUE,S109,0)","v":0},null,{"$f":"(C115-C113)/(A115-A113)*(A114-A113)+C113","v":833.33333333333326},{"$f":"(E114-C114)/(E100-C100)*(D100-C100)+C114","v":388.88888888888874},{"$f":"(E115-E113)/(A115-A113)*(A114-A113)+E113","v":1500},{"$f":"(G114-E114)/(G100-E100)*(F100-E100)+E114","v":-1333.333333333333},{"$f":"(G115-G113)/(A115-A113)*(A114-A113)+G113","v":4333.333333333333},{"$f":"(I114-G114)/(I100-G100)*(H100-G100)+G114","v":8199.9999999999982},2400,{"$f":"(K114-I114)/(K100-I100)*(J100-I100)+I114","v":-4399.9999999999982},{"$f":"(K115-K113)/(A115-A113)*(A114-A113)+K113","v":4666.6666666666661},{"$f":"(M114-K114)/(M100-K100)*(L100-K100)+K114","v":3999.9999999999982},{"$f":"(M115-M113)/(A115-A113)*(A114-A113)+M113","v":5000},{"$f":"(O114-M114)/(O100-M100)*(N100-M100)+M114","v":4500},{"$f":"(O115-O113)/(A115-A113)*(A114-A113)+O113","v":5333.333333333333},{"$f":"(Q114-O114)/(Q100-O100)*(P100-O100)+O114","v":-1000},{"$f":"(Q115-Q113)/(A115-A113)*(A114-A113)+Q113","v":11666.666666666666}]
[40,null,3500,{"$f":"(E115-C115)/(E100-C100)*(D100-C100)+C115","v":2166.6666666666665},5500,{"$f":"(G115-E115)/(G100-E100)*(F100-E100)+E115","v":4000},7000,{"$f":"(I115-G115)/(I100-G100)*(H100-G100)+G115","v":5000},8000,{"$f":"(K115-I115)/(K100-I100)*(J100-I100)+I115","v":2000},10000,{"$f":"(M115-K115)/(M100-K100)*(L100-K100)+K115","v":4000},13000,{"$f":"(O115-M115)/(O100-M100)*(N100-M100)+M115","v":8500},16000,{"$f":"(Q115-O115)/(Q100-O100)*(P100-O100)+O115","v":11000},21000]
[{"$f":"IF(AND(S111>A115,S111<A117)=TRUE,S111,0)","v":0},null,{"$f":"(C117-C115)/(A117-A115)*(A116-A115)+C115","v":1500},{"$f":"(E116-C116)/(E104-C104)*(D104-C104)+C116","v":166.66666666666652},{"$f":"(E117-E115)/(A117-A115)*(A116-A115)+E115","v":3500},{"$f":"(G116-E116)/(G104-E104)*(F104-E104)+E116","v":1333.3333333333339},{"$f":"(G117-G115)/(A117-A115)*(A116-A115)+G115","v":5666.6666666666661},{"$f":"(I116-G116)/(I104-G104)*(H104-G104)+G116","v":12199.999999999996},2400,{"$f":"(K116-I116)/(K104-I104)*(J104-I104)+I116","v":-8400},{"$f":"(K117-K115)/(A117-A115)*(A116-A115)+K115","v":6000},{"$f":"(M116-K116)/(M104-K104)*(L104-K104)+K116","v":0},{"$f":"(M117-M115)/(A117-A115)*(A116-A115)+M115","v":9000},{"$f":"(O116-M116)/(O104-M104)*(N104-M104)+M116","v":8500},{"$f":"(O117-O115)/(A117-A115)*(A116-A115)+O115","v":9333.3333333333339},{"$f":"(Q116-O116)/(Q104-O104)*(P104-O104)+O116","v":9666.6666666666679},{"$f":"(Q117-Q115)/(A117-A115)*(A116-A115)+Q115","v":9000}]
[70,null,5000,{"$f":"(E117-C117)/(E104-C104)*(D104-C104)+C117","v":3666.6666666666665},7000,{"$f":"(G117-E117)/(G104-E104)*(F104-E104)+E117","v":6000},8000,{"$f":"(I117-G117)/(I104-G104)*(H104-G104)+G117","v":4000},10000,{"$f":"(K117-I117)/(K104-I104)*(J104-I104)+I117","v":1000},13000,{"$f":"(M117-K117)/(M104-K104)*(L104-K104)+K117","v":7000},16000,{"$f":"(O117-M117)/(O104-M104)*(N104-M104)+M117","v":8500},21000,{"$f":"(Q117-O117)/(Q104-O104)*(P104-O104)+O117","v":12000},30000,null,null,null,"VALORI LIMITE"]
[]
[]
[]
["COL",null,3,4,5,6,7,8,9,10,11,12,13,14,15,16,17]
[]
[]
[null,"DP",10,{"$f":"IF(AND(V131>C124,V131<E124)=TRUE,V131,0)","v":0},25,{"$f":"IF(AND(V131>E124,V131<G124)=TRUE,V131,0)","v":0},50,{"$f":"IF(AND(V131>G124,V131<I124)=TRUE,V131,0)","v":0},75,{"$f":"IF(AND(V131>I124,V131<K124)=TRUE,V131,0)","v":0},100,{"$f":"IF(AND(V131>K124,V131<M124)=TRUE,V131,0)","v":0},150,{"$f":"IF(AND(V131>M124,V131<O124)=TRUE,V131,0)","v":0},250,{"$f":"IF(AND(V131>O124,V131<Q124)=TRUE,V131,0)","v":0},500]
["PM"]
[]
[0.5,null,670,{"$f":"(E127-C127)/(E124-C124)*(D124-C124)+C127","v":383.33333333333331},1100,{"$f":"(G127-E127)/(G124-E124)*(F124-E124)+E127","v":900},1300,{"$f":"(I127-G127)/(I124-G124)*(H124-G124)+G127","v":1299.9000000000001},1300.05,{"$f":"(K127-I127)/(K124-I124)*(J124-I124)+I127","v":1299.9000000000001},1300.0999999999999,{"$f":"(M127-K127)/(M124-K124)*(L124-K124)+K127","v":1299.8999999999996},1300.2,{"$f":"(O127-M127)/(O124-M124)*(N124-M124)+M127","v":1300.0500000000002},1300.3,{"$f":"(Q127-O127)/(Q124-O124)*(P124-O124)+O127","v":1300.1999999999998},1300.4000000000001,null,"PM","Q","Qcal","DPcal","DP","TIPO"]
[{"$f":"IF(AND(S131>A127,S131<A129)=TRUE,S131,0)","v":0},null,{"$f":"(C129-C127)/(A129-A127)*(A128-A127)+C127","v":565},{"$f":"(E128-C128)/(E124-C124)*(D124-C124)+C128","v":328.33333333333331},{"$f":"(E129-E127)/(A129-A127)*(A128-A127)+E127","v":920},{"$f":"(G128-E128)/(G124-E124)*(F124-E124)+E128","v":940},{"$f":"(G129-G127)/(A129-A127)*(A128-A127)+G127","v":900},{"$f":"(I128-G128)/(I124-G124)*(H124-G124)+G128","v":900},{"$f":"(I129-I127)/(A129-A127)*(A128-A127)+I127","v":900},{"$f":"(K128-I128)/(K124-I124)*(J124-I124)+I128","v":900.00000000000068},{"$f":"(K129-K127)/(A129-A127)*(A128-A127)+K127","v":899.99999999999977},{"$f":"(M128-K128)/(M124-K124)*(L124-K124)+K128","v":899.79999999999905},{"$f":"(M129-M127)/(A129-A127)*(A128-A127)+M127","v":900.10000000000014},{"$f":"(O128-M128)/(O124-M124)*(N124-M124)+M128","v":899.95000000000061},{"$f":"(O129-O127)/(A129-A127)*(A128-A127)+O127","v":900.19999999999982},{"$f":"(Q128-O128)/(Q124-O124)*(P124-O124)+O128","v":900.08999999999946},{"$f":"(Q129-Q127)/(A129-A127)*(A128-A127)+Q127","v":900.31000000000017}]
[1,null,775,{"$f":"(E129-C129)/(E124-C124)*(D124-C124)+C129","v":438.33333333333337},1280,{"$f":"(G129-E129)/(G124-E124)*(F124-E124)+E129","v":860},1700,{"$f":"(I129-G129)/(I124-G124)*(H124-G124)+G129","v":1699.8000000000002},1700.1,{"$f":"(K129-I129)/(K124-I124)*(J124-I124)+I129","v":1699.7999999999995},1700.2,{"$f":"(M129-K129)/(M124-K124)*(L124-K124)+K129","v":1700.0000000000002},1700.3,{"$f":"(O129-M129)/(O124-M124)*(N124-M124)+M129","v":1700.1499999999996},1700.4,{"$f":"(Q129-O129)/(Q124-O124)*(P124-O124)+O129","v":1700.3100000000002},1700.49,null,null,"Stmc/h","Stmc/h","Mbar","Mbar"]
[{"$f":"IF(AND(S131>A129,S131<A131)=TRUE,S131,0)","v":0},null,{"$f":"(C131-C129)/(A131-A129)*(A130-A129)+C129","v":580},{"$f":"(E130-C130)/(E124-C124)*(D124-C124)+C130","v":320},{"$f":"(E131-E129)/(A131-A129)*(A130-A129)+E129","v":970},{"$f":"(G130-E130)/(G124-E124)*(F124-E124)+E130","v":840},{"$f":"(G131-G129)/(A131-A129)*(A130-A129)+G129","v":1100},{"$f":"(I130-G130)/(I124-G124)*(H124-G124)+G130","v":1699.6000000000004},{"$f":"(I131-I129)/(A131-A129)*(A130-A129)+I129","v":800.19999999999982},{"$f":"(K130-I130)/(K124-I124)*(J124-I124)+I130","v":799.89999999999873},{"$f":"(K131-K129)/(A131-A129)*(A130-A129)+K129","v":800.30000000000018},{"$f":"(M130-K130)/(M124-K124)*(L124-K124)+K130","v":800.10000000000036},{"$f":"(M131-M129)/(A131-A129)*(A130-A129)+M129","v":800.40000000000009},{"$f":"(O130-M130)/(O124-M124)*(N124-M124)+M130","v":800.25000000000023},{"$f":"(O131-O129)/(A131-A129)*(A130-A129)+O129","v":800.5},{"$f":"(Q130-O130)/(Q124-O124)*(P124-O124)+O130","v":800.42000000000007},{"$f":"(Q131-Q129)/(A131-A129)*(A130-A129)+Q129","v":800.57999999999993}]
[2,null,970,{"$f":"(E131-C131)/(E124-C124)*(D124-C124)+C131","v":556.66666666666663},1590,{"$f":"(G131-E131)/(G124-E124)*(F124-E124)+E131","v":880},2300,{"$f":"(I131-G131)/(I124-G124)*(H124-G124)+G131","v":1700},2600,{"$f":"(K131-I131)/(K124-I124)*(J124-I124)+I131","v":2599.7000000000003},2600.1,{"$f":"(M131-K131)/(M124-K124)*(L124-K124)+K131","v":2599.9},2600.1999999999998,{"$f":"(O131-M131)/(O124-M124)*(N124-M124)+M131","v":2600.0499999999993},2600.3000000000002,{"$f":"(Q131-O131)/(Q124-O124)*(P124-O124)+O131","v":2600.2000000000003},2600.4,null,{"$f":"Лист1!B17*10","v":0.1},{"$f":"DIMENSIONAMENTO!$D$12","v":3000},{"$f":"VLOOKUP(S131,A124:Q145,HLOOKUP(V131,A124:Q145,22,0),0)","v":{"$error":"#N/A"}},{"$f":"DIMENSIONAMENTO!$E$21","v":100},{"$f":"IF(S131<A127,\"NO\",IF(S131>A141,\"NO\",IF(VLOOKUP(S131,A127:Q141,3,0)>T131,\"NO\",IF(VLOOKUP(S131,A127:Q141,17,0)<T131,\"NO\",IF(AND(U131>=T131-0.1,U131<T131+0.1)=TRUE,V131,\"NO\")))))","v":"NO"},"FA-12-AP/","100-S"]
[{"$f":"IF(AND(S131>A131,S131<A133)=TRUE,S131,0)","v":0},null,{"$f":"(C133-C131)/(A133-A131)*(A132-A131)+C131","v":683.33333333333326},{"$f":"(E132-C132)/(E124-C124)*(D124-C124)+C132","v":416.66666666666657},{"$f":"(E133-E131)/(A133-A131)*(A132-A131)+E131","v":1083.3333333333333},{"$f":"(G132-E132)/(G124-E124)*(F124-E124)+E132","v":566.66666666666652},{"$f":"(G133-G131)/(A133-A131)*(A132-A131)+G131","v":1600},{"$f":"(I132-G132)/(I124-G124)*(H124-G124)+G132","v":1733.3333333333335},{"$f":"(I133-I131)/(A133-A131)*(A132-A131)+I131","v":1533.3333333333333},{"$f":"(K132-I132)/(K124-I124)*(J124-I124)+I132","v":2932.833333333333},{"$f":"(K133-K131)/(A133-A131)*(A132-A131)+K131","v":1066.8333333333333},{"$f":"(M132-K132)/(M124-K124)*(L124-K124)+K132","v":1333.1666666666672},{"$f":"(M133-M131)/(A133-A131)*(A132-A131)+M131","v":933.66666666666629},{"$f":"(O132-M132)/(O124-M124)*(N124-M124)+M132","v":933.51666666666574},{"$f":"(O133-O131)/(A133-A131)*(A132-A131)+O131","v":933.76666666666665},{"$f":"(Q132-O132)/(Q124-O124)*(P124-O124)+O132","v":933.66666666666629},{"$f":"(Q133-Q131)/(A133-A131)*(A132-A131)+Q131","v":933.86666666666702}]
[5,null,1400,{"$f":"(E133-C133)/(E124-C124)*(D124-C124)+C133","v":766.66666666666663},2350,{"$f":"(G133-E133)/(G124-E124)*(F124-E124)+E133","v":1350},3350,{"$f":"(I133-G133)/(I124-G124)*(H124-G124)+G133","v":1650},4200,{"$f":"(K133-I133)/(K124-I124)*(J124-I124)+I133","v":2100},4900,{"$f":"(M133-K133)/(M124-K124)*(L124-K124)+K133","v":4500},5100,{"$f":"(O133-M133)/(O124-M124)*(N124-M124)+M133","v":5099.8499999999995},5100.1000000000004,{"$f":"(Q133-O133)/(Q124-O124)*(P124-O124)+O133","v":5100.0000000000009},5100.2]
[{"$f":"IF(AND(S131>A133,S131<A135)=TRUE,S131,0)","v":0},null,{"$f":"(C135-C133)/(A135-A133)*(A134-A133)+C133","v":850},{"$f":"(E134-C134)/(E124-C124)*(D124-C124)+C134","v":416.66666666666663},{"$f":"(E135-E133)/(A135-A133)*(A134-A133)+E133","v":1500},{"$f":"(G134-E134)/(G124-E124)*(F124-E124)+E134","v":950},{"$f":"(G135-G133)/(A135-A133)*(A134-A133)+G133","v":2050},{"$f":"(I134-G134)/(I124-G124)*(H124-G124)+G134","v":950},{"$f":"(I135-I133)/(A135-A133)*(A134-A133)+I133","v":2600},{"$f":"(K134-I134)/(K124-I124)*(J124-I124)+I134","v":1100},{"$f":"(K135-K133)/(A135-A133)*(A134-A133)+K133","v":3100},{"$f":"(M134-K134)/(M124-K124)*(L124-K124)+K134","v":5500},{"$f":"(M135-M133)/(A135-A133)*(A134-A133)+M133","v":1900},{"$f":"(O134-M134)/(O124-M124)*(N124-M124)+M134","v":3549.6999999999989},{"$f":"(O135-O133)/(A135-A133)*(A134-A133)+O133","v":800.20000000000073},{"$f":"(Q134-O134)/(Q124-O124)*(P124-O124)+O134","v":800.10000000000218},{"$f":"(Q135-Q133)/(A135-A133)*(A134-A133)+Q133","v":800.29999999999927}]
[10,null,1950,{"$f":"(E135-C135)/(E124-C124)*(D124-C124)+C135","v":1116.6666666666667},3200,{"$f":"(G135-E135)/(G124-E124)*(F124-E124)+E135","v":1750},4650,{"$f":"(I135-G135)/(I124-G124)*(H124-G124)+G135","v":2350},5800,{"$f":"(K135-I135)/(K124-I124)*(J124-I124)+I135","v":3100},6700,{"$f":"(M135-K135)/(M124-K124)*(L124-K124)+K135","v":3500},8300,{"$f":"(O135-M135)/(O124-M124)*(N124-M124)+M135","v":6650},9400,{"$f":"(Q135-O135)/(Q124-O124)*(P124-O124)+O135","v":9399.9},9400.1]
[{"$f":"IF(AND(S131>A135,S131<A137)=TRUE,S131,0)","v":0},null,{"$f":"(C137-C135)/(A137-A135)*(A136-A135)+C135","v":1183.3333333333333},{"$f":"(E136-C136)/(E124-C124)*(D124-C124)+C136","v":661.11111111111086},{"$f":"(E137-E135)/(A137-A135)*(A136-A135)+E135","v":1966.6666666666667},{"$f":"(G136-E136)/(G124-E124)*(F124-E124)+E136","v":1083.3333333333335},{"$f":"(G137-G135)/(A137-A135)*(A136-A135)+G135","v":2850},{"$f":"(I136-G136)/(I124-G124)*(H124-G124)+G136","v":3750},2400,{"$f":"(K136-I136)/(K124-I124)*(J124-I124)+I136","v":-2700},{"$f":"(K137-K135)/(A137-A135)*(A136-A135)+K135","v":4100},{"$f":"(M136-K136)/(M124-K124)*(L124-K124)+K136","v":2233.3333333333339},{"$f":"(M137-M135)/(A137-A135)*(A136-A135)+M135","v":5033.333333333333},{"$f":"(O136-M136)/(O124-M124)*(N124-M124)+M136","v":6283.3333333333321},{"$f":"(O137-O135)/(A137-A135)*(A136-A135)+O135","v":4200},{"$f":"(Q136-O136)/(Q124-O124)*(P124-O124)+O136","v":7466.5},{"$f":"(Q137-Q135)/(A137-A135)*(A136-A135)+Q135","v":933.5}]
[25,null,3100,{"$f":"(E137-C137)/(E124-C124)*(D124-C124)+C137","v":1800},5050,{"$f":"(G137-E137)/(G124-E124)*(F124-E124)+E137","v":2750},7350,{"$f":"(I137-G137)/(I124-G124)*(H124-G124)+G137","v":3850},9100,{"$f":"(K137-I137)/(K124-I124)*(J124-I124)+I137","v":4600},10600,{"$f":"(M137-K137)/(M124-K124)*(L124-K124)+K137","v":5400},13200,{"$f":"(O137-M137)/(O124-M124)*(N124-M124)+M137","v":7200},17200,{"$f":"(Q137-O137)/(Q124-O124)*(P124-O124)+O137","v":12300},22100]
[{"$f":"IF(AND(S133>A137,S133<A139)=TRUE,S133,0)","v":0},null,{"$f":"(C139-C137)/(A139-A137)*(A138-A137)+C137","v":1683.3333333333335},{"$f":"(E138-C138)/(E124-C124)*(D124-C124)+C138","v":994.44444444444446},{"$f":"(E139-E137)/(A139-A137)*(A138-A137)+E137","v":2716.666666666667},{"$f":"(G138-E138)/(G124-E124)*(F124-E124)+E138","v":1500.0000000000005},{"$f":"(G139-G137)/(A139-A137)*(A138-A137)+G137","v":3933.3333333333335},{"$f":"(I138-G138)/(I124-G124)*(H124-G124)+G138","v":7000},2400,{"$f":"(K138-I138)/(K124-I124)*(J124-I124)+I138","v":-7699.9999999999964},{"$f":"(K139-K137)/(A139-A137)*(A138-A137)+K137","v":5766.6666666666661},{"$f":"(M138-K138)/(M124-K124)*(L124-K124)+K138","v":2566.6666666666661},{"$f":"(M139-M137)/(A139-A137)*(A138-A137)+M137","v":7366.6666666666661},{"$f":"(O138-M138)/(O124-M124)*(N124-M124)+M138","v":4616.6666666666652},{"$f":"(O139-O137)/(A139-A137)*(A138-A137)+O137","v":9200},{"$f":"(Q138-O138)/(Q124-O124)*(P124-O124)+O138","v":12300},{"$f":"(Q139-Q137)/(A139-A137)*(A138-A137)+Q137","v":6100}]
[40,null,3950,{"$f":"(E139-C139)/(E124-C124)*(D124-C124)+C139","v":2283.3333333333335},6450,{"$f":"(G139-E139)/(G124-E124)*(F124-E124)+E139","v":3500},9400,{"$f":"(I139-G139)/(I124-G124)*(H124-G124)+G139","v":5000},11600,{"$f":"(K139-I139)/(K124-I124)*(J124-I124)+I139","v":5900},13500,{"$f":"(M139-K139)/(M124-K124)*(L124-K124)+K139","v":7100},16700,{"$f":"(O139-M139)/(O124-M124)*(N124-M124)+M139","v":8750},22000,{"$f":"(Q139-O139)/(Q124-O124)*(P124-O124)+O139","v":12300},31700]
[{"$f":"IF(AND(S135>A139,S135<A141)=TRUE,S135,0)","v":0},null,{"$f":"(C141-C139)/(A141-A139)*(A140-A139)+C139","v":2216.6666666666665},{"$f":"(E140-C140)/(E128-C128)*(D128-C128)+C140","v":1332.2222222222222},{"$f":"(E141-E139)/(A141-A139)*(A140-A139)+E139","v":3543.333333333333},{"$f":"(G140-E140)/(G128-E128)*(F128-E128)+E140","v":1819.9999999999991},{"$f":"(G141-G139)/(A141-A139)*(A140-A139)+G139","v":5266.666666666667},{"$f":"(I140-G140)/(I128-G128)*(H128-G128)+G140","v":{"$error":"#DIV/0!"}},2400,{"$f":"(K140-I140)/(K128-I128)*(J128-I128)+I140","v":-12900},{"$f":"(K141-K139)/(A141-A139)*(A140-A139)+K139","v":7500},{"$f":"(M140-K140)/(M128-K128)*(L128-K128)+K140","v":4566.6666666666679},{"$f":"(M141-M139)/(A141-A139)*(A140-A139)+M139","v":8966.6666666666661},{"$f":"(O140-M140)/(O128-M128)*(N128-M128)+M140","v":4216.6666666666642},{"$f":"(O141-O139)/(A141-A139)*(A140-A139)+O139","v":12133.333333333334},{"$f":"(Q140-O140)/(Q128-O128)*(P128-O128)+O140","v":6833.3333333333358},{"$f":"(Q141-Q139)/(A141-A139)*(A140-A139)+Q139","v":17433.333333333332}]
[70,null,5250,{"$f":"(E141-C141)/(E128-C128)*(D128-C128)+C141","v":2996.6666666666665},8630,{"$f":"(G141-E141)/(G128-E128)*(F128-E128)+E141","v":4760},12500,{"$f":"(I141-G141)/(I128-G128)*(H128-G128)+G141","v":{"$error":"#DIV/0!"}},15500,{"$f":"(K141-I141)/(K128-I128)*(J128-I128)+I141","v":8000},18000,{"$f":"(M141-K141)/(M128-K128)*(L128-K128)+K141","v":9000},22500,{"$f":"(O141-M141)/(O128-M128)*(N128-M128)+M141","v":12150},29400,{"$f":"(Q141-O141)/(Q128-O128)*(P128-O128)+O141","v":16400},42400,null,null,null,"VALORI LIMITE"]
[]
[]
[]
["COL",null,3,4,5,6,7,8,9,10,11,12,13,14,15,16,17]
[]
[]
[null,"DP",10,{"$f":"IF(AND(V155>C148,V155<E148)=TRUE,V155,0)","v":0},25,{"$f":"IF(AND(V155>E148,V155<G148)=TRUE,V155,0)","v":0},50,{"$f":"IF(AND(V155>G148,V155<I148)=TRUE,V155,0)","v":0},75,{"$f":"IF(AND(V155>I148,V155<K148)=TRUE,V155,0)","v":0},100,{"$f":"IF(AND(V155>K148,V155<M148)=TRUE,V155,0)","v":0},150,{"$f":"IF(AND(V155>M148,V155<O148)=TRUE,V155,0)","v":0},250,{"$f":"IF(AND(V155>O148,V155<Q148)=TRUE,V155,0)","v":0},500]
["PM"]
[]
[0.5,null,1800,{"$f":"(E151-C151)/(E148-C148)*(D148-C148)+C151","v":1133.3333333333333},2800,{"$f":"(G151-E151)/(G148-E148)*(F148-E148)+E151","v":2799.95},2800.05,{"$f":"(I151-G151)/(I148-G148)*(H148-G148)+G151","v":2799.9500000000007},2800.1,{"$f":"(K151-I151)/(K148-I148)*(J148-I148)+I151","v":2799.8},2800.2,{"$f":"(M151-K151)/(M148-K148)*(L148-K148)+K151","v":2799.9999999999991},2800.3,{"$f":"(O151-M151)/(O148-M148)*(N148-M148)+M151","v":2800.1500000000005},2800.4,{"$f":"(Q151-O151)/(Q148-O148)*(P148-O148)+O151","v":2800.3100000000004},2800.49,null,"PM","Q","Qcal","DPcal","DP","TIPO"]
[{"$f":"IF(AND(S155>A151,S155<A153)=TRUE,S155,0)","v":0},null,{"$f":"(C153-C151)/(A153-A151)*(A152-A151)+C151","v":1500},{"$f":"(E152-C152)/(E148-C148)*(D148-C148)+C152","v":900},{"$f":"(E153-E151)/(A153-A151)*(A152-A151)+E151","v":2400},{"$f":"(G152-E152)/(G148-E148)*(F148-E148)+E152","v":3199.8999999999996},{"$f":"(G153-G151)/(A153-A151)*(A152-A151)+G151","v":1600.1000000000004},{"$f":"(I152-G152)/(I148-G148)*(H148-G148)+G152","v":1600.1000000000013},{"$f":"(I153-I151)/(A153-A151)*(A152-A151)+I151","v":1600.1},{"$f":"(K152-I152)/(K148-I148)*(J148-I148)+I152","v":1599.8000000000002},{"$f":"(K153-K151)/(A153-A151)*(A152-A151)+K151","v":1600.1999999999998},{"$f":"(M152-K152)/(M148-K148)*(L148-K148)+K152","v":1599.9999999999991},{"$f":"(M153-M151)/(A153-A151)*(A152-A151)+M151","v":1600.3000000000002},{"$f":"(O152-M152)/(O148-M148)*(N148-M148)+M152","v":1600.1500000000003},{"$f":"(O153-O151)/(A153-A151)*(A152-A151)+O151","v":1600.4},{"$f":"(Q152-O152)/(Q148-O148)*(P148-O148)+O152","v":1600.3100000000004},{"$f":"(Q153-Q151)/(A153-A151)*(A152-A151)+Q151","v":1600.4899999999998}]
[1,null,2100,{"$f":"(E153-C153)/(E148-C148)*(D148-C148)+C153","v":1366.6666666666667},3200,{"$f":"(G153-E153)/(G148-E148)*(F148-E148)+E153","v":2400},4000,{"$f":"(I153-G153)/(I148-G148)*(H148-G148)+G153","v":3999.8},4000.1,{"$f":"(K153-I153)/(K148-I148)*(J148-I148)+I153","v":3999.8},4000.2,{"$f":"(M153-K153)/(M148-K148)*(L148-K148)+K153","v":3999.9999999999991},4000.3,{"$f":"(O153-M153)/(O148-M148)*(N148-M148)+M153","v":4000.1500000000005},4000.4,{"$f":"(Q153-O153)/(Q148-O148)*(P148-O148)+O153","v":4000.3100000000004},4000.49,null,null,"Stmc/h","Stmc/h","Mbar","Mbar"]
[{"$f":"IF(AND(S155>A153,S155<A155)=TRUE,S155,0)","v":0},null,{"$f":"(C155-C153)/(A155-A153)*(A154-A153)+C153","v":1600},{"$f":"(E154-C154)/(E148-C148)*(D148-C148)+C154","v":1066.6666666666665},{"$f":"(E155-E153)/(A155-A153)*(A154-A153)+E153","v":2400},{"$f":"(G154-E154)/(G148-E148)*(F148-E148)+E154","v":2300},{"$f":"(G155-G153)/(A155-A153)*(A154-A153)+G153","v":2500},{"$f":"(I154-G154)/(I148-G148)*(H148-G148)+G154","v":2499.8000000000011},{"$f":"(I155-I153)/(A155-A153)*(A154-A153)+I153","v":2500.0999999999995},{"$f":"(K154-I154)/(K148-I148)*(J148-I148)+I154","v":2499.7999999999984},{"$f":"(K155-K153)/(A155-A153)*(A154-A153)+K153","v":2500.1999999999998},{"$f":"(M154-K154)/(M148-K148)*(L148-K148)+K154","v":2499.9999999999991},{"$f":"(M155-M153)/(A155-A153)*(A154-A153)+M153","v":2500.3000000000002},{"$f":"(O154-M154)/(O148-M148)*(N148-M148)+M154","v":2500.1499999999996},{"$f":"(O155-O153)/(A155-A153)*(A154-A153)+O153","v":2500.4000000000005},{"$f":"(Q154-O154)/(Q148-O148)*(P148-O148)+O154","v":2500.3100000000013},{"$f":"(Q155-Q153)/(A155-A153)*(A154-A153)+Q153","v":2500.4899999999998}]
[2,null,2600,{"$f":"(E155-C155)/(E148-C148)*(D148-C148)+C155","v":1666.6666666666667},4000,{"$f":"(G155-E155)/(G148-E148)*(F148-E148)+E155","v":2500},5500,{"$f":"(I155-G155)/(I148-G148)*(H148-G148)+G155","v":5499.7999999999993},5500.1,{"$f":"(K155-I155)/(K148-I148)*(J148-I148)+I155","v":5499.800000000002},5500.2,{"$f":"(M155-K155)/(M148-K148)*(L148-K148)+K155","v":5499.9999999999991},5500.3,{"$f":"(O155-M155)/(O148-M148)*(N148-M148)+M155","v":5500.1500000000015},5500.4,{"$f":"(Q155-O155)/(Q148-O148)*(P148-O148)+O155","v":5500.3099999999995},5500.49,null,{"$f":"Лист1!B17*10","v":0.1},{"$f":"DIMENSIONAMENTO!$D$12","v":3000},{"$f":"VLOOKUP(S155,A148:Q169,HLOOKUP(V155,A148:Q169,22,0),0)","v":{"$error":"#N/A"}},{"$f":"DIMENSIONAMENTO!$E$21","v":100},{"$f":"IF(S155<A151,\"NO\",IF(S155>A165,\"NO\",IF(VLOOKUP(S155,A151:Q165,3,0)>T155,\"NO\",IF(VLOOKUP(S155,A151:Q165,17,0)<T155,\"NO\",IF(AND(U155>=T155-0.1,U155<T155+0.1)=TRUE,V155,\"NO\")))))","v":"NO"},"FA-12-AP/",150]
[{"$f":"IF(AND(S155>A155,S155<A157)=TRUE,S155,0)","v":0},null,{"$f":"(C157-C155)/(A157-A155)*(A156-A155)+C155","v":2333.3333333333335},{"$f":"(E156-C156)/(E148-C148)*(D148-C148)+C156","v":1400.0000000000002},{"$f":"(E157-E155)/(A157-A155)*(A156-A155)+E155","v":3733.3333333333335},{"$f":"(G156-E156)/(G148-E148)*(F148-E148)+E156","v":3633.3333333333339},{"$f":"(G157-G155)/(A157-A155)*(A156-A155)+G155","v":3833.333333333333},{"$f":"(I156-G156)/(I148-G148)*(H148-G148)+G156","v":7832.9999999999982},{"$f":"(I157-I155)/(A157-A155)*(A156-A155)+I155","v":1833.5000000000005},{"$f":"(K156-I156)/(K148-I148)*(J148-I148)+I156","v":1833.2000000000035},{"$f":"(K157-K155)/(A157-A155)*(A156-A155)+K155","v":1833.5999999999995},{"$f":"(M156-K156)/(M148-K148)*(L148-K148)+K156","v":1833.3999999999987},{"$f":"(M157-M155)/(A157-A155)*(A156-A155)+M155","v":1833.6999999999998},{"$f":"(O156-M156)/(O148-M148)*(N148-M148)+M156","v":1833.55},{"$f":"(O157-O155)/(A157-A155)*(A156-A155)+O155","v":1833.7999999999997},{"$f":"(Q156-O156)/(Q148-O148)*(P148-O148)+O156","v":1833.7166666666662},{"$f":"(Q157-Q155)/(A157-A155)*(A156-A155)+Q155","v":1833.8833333333332}]
[5,null,3000,{"$f":"(E157-C157)/(E148-C148)*(D148-C148)+C157","v":2066.666666666667},4400,{"$f":"(G157-E157)/(G148-E148)*(F148-E148)+E157","v":800},8000,{"$f":"(I157-G157)/(I148-G148)*(H148-G148)+G157","v":2000},11000,{"$f":"(K157-I157)/(K148-I148)*(J148-I148)+I157","v":10999.699999999999},11000.1,{"$f":"(M157-K157)/(M148-K148)*(L148-K148)+K157","v":10999.9},11000.2,{"$f":"(O157-M157)/(O148-M148)*(N148-M148)+M157","v":11000.050000000003},11000.3,{"$f":"(Q157-O157)/(Q148-O148)*(P148-O148)+O157","v":11000.199999999999},11000.4]
[{"$f":"IF(AND(S155>A157,S155<A159)=TRUE,S155,0)","v":0},null,{"$f":"(C159-C157)/(A159-A157)*(A158-A157)+C157","v":1500},{"$f":"(E158-C158)/(E148-C148)*(D148-C148)+C158","v":966.66666666666663},{"$f":"(E159-E157)/(A159-A157)*(A158-A157)+E157","v":2300},{"$f":"(G158-E158)/(G148-E148)*(F148-E148)+E158","v":-1400},{"$f":"(G159-G157)/(A159-A157)*(A158-A157)+G157","v":6000},{"$f":"(I158-G158)/(I148-G148)*(H148-G148)+G158","v":-2000},{"$f":"(I159-I157)/(A159-A157)*(A158-A157)+I157","v":10000},{"$f":"(K158-I158)/(K148-I148)*(J148-I148)+I158","v":21999.399999999998},{"$f":"(K159-K157)/(A159-A157)*(A158-A157)+K157","v":6000.2000000000007},{"$f":"(M158-K158)/(M148-K148)*(L148-K148)+K158","v":13999.8},{"$f":"(M159-M157)/(A159-A157)*(A158-A157)+M157","v":2000.4000000000015},{"$f":"(O158-M158)/(O148-M148)*(N148-M148)+M158","v":2000.2500000000036},{"$f":"(O159-O157)/(A159-A157)*(A158-A157)+O157","v":2000.5},{"$f":"(Q158-O158)/(Q148-O148)*(P148-O148)+O158","v":2000.4000000000015},{"$f":"(Q159-Q157)/(A159-A157)*(A158-A157)+Q157","v":2000.5999999999985}]
[10,null,4500,{"$f":"(E159-C159)/(E148-C148)*(D148-C148)+C159","v":3166.6666666666665},6500,{"$f":"(G159-E159)/(G148-E148)*(F148-E148)+E159","v":3000},10000,{"$f":"(I159-G159)/(I148-G148)*(H148-G148)+G159","v":6000},12000,{"$f":"(K159-I159)/(K148-I148)*(J148-I148)+I159","v":0},16000,{"$f":"(M159-K159)/(M148-K148)*(L148-K148)+K159","v":8000},20000,{"$f":"(O159-M159)/(O148-M148)*(N148-M148)+M159","v":19999.850000000002},20000.099999999999,{"$f":"(Q159-O159)/(Q148-O148)*(P148-O148)+O159","v":19999.999999999996},20000.2]
[{"$f":"IF(AND(S155>A159,S155<A161)=TRUE,S155,0)","v":0},null,{"$f":"(C161-C159)/(A161-A159)*(A160-A159)+C159","v":3166.6666666666665},{"$f":"(E160-C160)/(E148-C148)*(D148-C148)+C160","v":2500},{"$f":"(E161-E159)/(A161-A159)*(A160-A159)+E159","v":4166.6666666666661},{"$f":"(G160-E160)/(G148-E148)*(F148-E148)+E160","v":999.99999999999909},{"$f":"(G161-G159)/(A161-A159)*(A160-A159)+G159","v":7333.333333333333},{"$f":"(I160-G160)/(I148-G148)*(H148-G148)+G160","v":17200},2400,{"$f":"(K160-I160)/(K148-I148)*(J148-I148)+I160","v":-30399.999999999993},{"$f":"(K161-K159)/(A161-A159)*(A160-A159)+K159","v":13333.333333333332},{"$f":"(M160-K160)/(M148-K148)*(L148-K148)+K160","v":7999.9999999999964},{"$f":"(M161-M159)/(A161-A159)*(A160-A159)+M159","v":16000},{"$f":"(O160-M160)/(O148-M148)*(N148-M148)+M160","v":24999.750000000004},{"$f":"(O161-O159)/(A161-A159)*(A160-A159)+O159","v":10000.166666666664},{"$f":"(Q160-O160)/(Q148-O148)*(P148-O148)+O160","v":17333.333333333328},{"$f":"(Q161-Q159)/(A161-A159)*(A160-A159)+Q159","v":2667}]
[25,null,6500,{"$f":"(E161-C161)/(E148-C148)*(D148-C148)+C161","v":4166.6666666666661},10000,{"$f":"(G161-E161)/(G148-E148)*(F148-E148)+E161","v":6000},14000,{"$f":"(I161-G161)/(I148-G148)*(H148-G148)+G161","v":6000},18000,{"$f":"(K161-I161)/(K148-I148)*(J148-I148)+I161","v":12000},20000,{"$f":"(M161-K161)/(M148-K148)*(L148-K148)+K161","v":8000},26000,{"$f":"(O161-M161)/(O148-M148)*(N148-M148)+M161","v":12500},35000,{"$f":"(Q161-O161)/(Q148-O148)*(P148-O148)+O161","v":24000},46000]
[{"$f":"IF(AND(S157>A161,S157<A163)=TRUE,S157,0)","v":0},null,{"$f":"(C163-C161)/(A163-A161)*(A162-A161)+C161","v":3166.6666666666665},{"$f":"(E162-C162)/(E148-C148)*(D148-C148)+C162","v":1944.4444444444443},{"$f":"(E163-E161)/(A163-A161)*(A162-A161)+E161","v":5000},{"$f":"(G162-E162)/(G148-E148)*(F148-E148)+E162","v":1000},{"$f":"(G163-G161)/(A163-A161)*(A162-A161)+G161","v":9000},{"$f":"(I162-G162)/(I148-G148)*(H148-G148)+G162","v":22200},2400,{"$f":"(K162-I162)/(K148-I148)*(J148-I148)+I162","v":-400.00000000000728},{"$f":"(K163-K161)/(A163-A161)*(A162-A161)+K161","v":3333.3333333333358},{"$f":"(M162-K162)/(M148-K148)*(L148-K148)+K162","v":-11999.999999999993},{"$f":"(M163-M161)/(A163-A161)*(A162-A161)+M161","v":11000},{"$f":"(O162-M162)/(O148-M148)*(N148-M148)+M162","v":-7499.9999999999964},{"$f":"(O163-O161)/(A163-A161)*(A162-A161)+O161","v":23333.333333333332},{"$f":"(Q162-O162)/(Q148-O148)*(P148-O148)+O162","v":27333.333333333332},{"$f":"(Q163-Q161)/(A163-A161)*(A162-A161)+Q161","v":19333.333333333332}]
[40,null,8500,{"$f":"(E163-C163)/(E148-C148)*(D148-C148)+C163","v":5500},13000,{"$f":"(G163-E163)/(G148-E148)*(F148-E148)+E163","v":9000},17000,{"$f":"(I163-G163)/(I148-G148)*(H148-G148)+G163","v":7000},22000,{"$f":"(K163-I163)/(K148-I148)*(J148-I148)+I163","v":-2000},30000,{"$f":"(M163-K163)/(M148-K148)*(L148-K148)+K163","v":20000},35000,{"$f":"(O163-M163)/(O148-M148)*(N148-M148)+M163","v":24500},42000,{"$f":"(Q163-O163)/(Q148-O148)*(P148-O148)+O163","v":22000},62000]
[{"$f":"IF(AND(S159>A163,S159<A165)=TRUE,S159,0)","v":0},null,{"$f":"(C165-C163)/(A165-A163)*(A164-A163)+C163","v":6500},{"$f":"(E164-C164)/(E152-C152)*(D152-C152)+C164","v":5722.2222222222226},{"$f":"(E165-E163)/(A165-A163)*(A164-A163)+E163","v":7666.6666666666661},{"$f":"(G164-E164)/(G152-E152)*(F152-E152)+E164","v":9000},{"$f":"(G165-G163)/(A165-A163)*(A164-A163)+G163","v":6333.3333333333321},{"$f":"(I164-G164)/(I152-G152)*(H152-G152)+G164","v":14199.999999999996},2400,{"$f":"(K164-I164)/(K152-I152)*(J152-I152)+I164","v":-40400},{"$f":"(K165-K163)/(A165-A163)*(A164-A163)+K163","v":16666.666666666668},{"$f":"(M164-K164)/(M152-K152)*(L152-K152)+K164","v":20000.000000000004},{"$f":"(M165-M163)/(A165-A163)*(A164-A163)+M163","v":15000},{"$f":"(O164-M164)/(O152-M152)*(N152-M152)+M164","v":10500},{"$f":"(O165-O163)/(A165-A163)*(A164-A163)+O163","v":18000},{"$f":"(Q164-O164)/(Q152-O152)*(P152-O152)+O164","v":11333.333333333336},{"$f":"(Q165-Q163)/(A165-A163)*(A164-A163)+Q163","v":24666.666666666664}]
[70,null,10000,{"$f":"(E165-C165)/(E152-C152)*(D152-C152)+C165","v":5333.333333333333},17000,{"$f":"(G165-E165)/(G152-E152)*(F152-E152)+E165","v":9000},25000,{"$f":"(I165-G165)/(I152-G152)*(H152-G152)+G165","v":11000},32000,{"$f":"(K165-I165)/(K152-I152)*(J152-I152)+I165","v":8000},40000,{"$f":"(M165-K165)/(M152-K152)*(L152-K152)+K165","v":20000},50000,{"$f":"(O165-M165)/(O152-M152)*(N152-M152)+M165","v":35000},60000,{"$f":"(Q165-O165)/(Q152-O152)*(P152-O152)+O165","v":30000},90000,null,null,null,"VALORI LIMITE"]
[]
[]
[]
["COL",null,3,4,5,6,7,8,9,10,11,12,13,14,15,16,17]
[]
[]
[null,"DP",10,{"$f":"IF(AND(V179>C172,V179<E172)=TRUE,V179,0)","v":0},25,{"$f":"IF(AND(V179>E172,V179<G172)=TRUE,V179,0)","v":0},50,{"$f":"IF(AND(V179>G172,V179<I172)=TRUE,V179,0)","v":0},75,{"$f":"IF(AND(V179>I172,V179<K172)=TRUE,V179,0)","v":0},100,{"$f":"IF(AND(V179>K172,V179<M172)=TRUE,V179,0)","v":0},150,{"$f":"IF(AND(V179>M172,V179<O172)=TRUE,V179,0)","v":0},250,{"$f":"IF(AND(V179>O172,V179<Q172)=TRUE,V179,0)","v":0},500]
["PM"]
[]
[0.5,null,2400,{"$f":"(E175-C175)/(E172-C172)*(D172-C172)+C175","v":1600},3600,{"$f":"(G175-E175)/(G172-E172)*(F172-E172)+E175","v":2200},5000,{"$f":"(I175-G175)/(I172-G172)*(H172-G172)+G175","v":4999.7999999999993},5000.1000000000004,{"$f":"(K175-I175)/(K172-I172)*(J172-I172)+I175","v":4999.800000000002},5000.2,{"$f":"(M175-K175)/(M172-K172)*(L172-K172)+K175","v":4999.9999999999991},5000.3,{"$f":"(O175-M175)/(O172-M172)*(N172-M172)+M175","v":5000.1500000000015},5000.3999999999996,{"$f":"(Q175-O175)/(Q172-O172)*(P172-O172)+O175","v":5000.3099999999995},5000.49,null,"PM","Q","Qcal","DPcal","DP","TIPO"]
[{"$f":"IF(AND(S179>A175,S179<A177)=TRUE,S179,0)","v":0},null,{"$f":"(C177-C175)/(A177-A175)*(A176-A175)+C175","v":2000},{"$f":"(E176-C176)/(E172-C172)*(D172-C172)+C176","v":1400},{"$f":"(E177-E175)/(A177-A175)*(A176-A175)+E175","v":2900},{"$f":"(G176-E176)/(G172-E172)*(F172-E172)+E176","v":2100},{"$f":"(G177-G175)/(A177-A175)*(A176-A175)+G175","v":3700},{"$f":"(I176-G176)/(I172-G172)*(H172-G172)+G176","v":4099.5999999999985},{"$f":"(I177-I175)/(A177-A175)*(A176-A175)+I175","v":3500.2000000000007},{"$f":"(K176-I176)/(K172-I172)*(J172-I172)+I176","v":3499.9000000000051},{"$f":"(K177-K175)/(A177-A175)*(A176-A175)+K175","v":3500.2999999999993},{"$f":"(M176-K176)/(M172-K172)*(L172-K172)+K176","v":3500.0999999999967},{"$f":"(M177-M175)/(A177-A175)*(A176-A175)+M175","v":3500.4000000000005},{"$f":"(O176-M176)/(O172-M172)*(N172-M172)+M176","v":3500.2500000000027},{"$f":"(O177-O175)/(A177-A175)*(A176-A175)+O175","v":3500.4999999999991},{"$f":"(Q176-O176)/(Q172-O172)*(P172-O172)+O176","v":3500.4199999999983},{"$f":"(Q177-Q175)/(A177-A175)*(A176-A175)+Q175","v":3500.58}]
[1,null,2800,{"$f":"(E177-C177)/(E172-C172)*(D172-C172)+C177","v":1800},4300,{"$f":"(G177-E177)/(G172-E172)*(F172-E172)+E177","v":2300},6300,{"$f":"(I177-G177)/(I172-G172)*(H172-G172)+G177","v":5900},6500,{"$f":"(K177-I177)/(K172-I172)*(J172-I172)+I177","v":6499.6999999999989},6500.1,{"$f":"(M177-K177)/(M172-K172)*(L172-K172)+K177","v":6499.9000000000015},6500.2,{"$f":"(O177-M177)/(O172-M172)*(N172-M172)+M177","v":6500.0499999999993},6500.3,{"$f":"(Q177-O177)/(Q172-O172)*(P172-O172)+O177","v":6500.2000000000007},6500.4,null,null,"Stmc/h","Stmc/h","Mbar","Mbar"]
[{"$f":"IF(AND(S179>A177,S179<A179)=TRUE,S179,0)","v":0},null,{"$f":"(C179-C177)/(A179-A177)*(A178-A177)+C177","v":2100},{"$f":"(E178-C178)/(E172-C172)*(D172-C172)+C178","v":1433.3333333333333},{"$f":"(E179-E177)/(A179-A177)*(A178-A177)+E177","v":3100},{"$f":"(G178-E178)/(G172-E172)*(F172-E172)+E178","v":1600},{"$f":"(G179-G177)/(A179-A177)*(A178-A177)+G177","v":4600},{"$f":"(I178-G178)/(I172-G172)*(H172-G172)+G178","v":7800},{"$f":"(I179-I177)/(A179-A177)*(A178-A177)+I177","v":3000},{"$f":"(K178-I178)/(K172-I172)*(J172-I172)+I178","v":2999.6999999999989},{"$f":"(K179-K177)/(A179-A177)*(A178-A177)+K177","v":3000.1000000000004},{"$f":"(M178-K178)/(M172-K172)*(L172-K172)+K178","v":2999.9000000000033},{"$f":"(M179-M177)/(A179-A177)*(A178-A177)+M177","v":3000.1999999999989},{"$f":"(O178-M178)/(O172-M172)*(N172-M172)+M178","v":3000.0499999999956},{"$f":"(O179-O177)/(A179-A177)*(A178-A177)+O177","v":3000.3000000000011},{"$f":"(Q178-O178)/(Q172-O172)*(P172-O172)+O178","v":3000.2000000000025},{"$f":"(Q179-Q177)/(A179-A177)*(A178-A177)+Q177","v":3000.3999999999996}]
[2,null,3500,{"$f":"(E179-C179)/(E172-C172)*(D172-C172)+C179","v":2166.6666666666665},5500,{"$f":"(G179-E179)/(G172-E172)*(F172-E172)+E179","v":3000},8000,{"$f":"(I179-G179)/(I172-G172)*(H172-G172)+G179","v":4000},10000,{"$f":"(K179-I179)/(K172-I172)*(J172-I172)+I179","v":9999.6999999999989},10000.1,{"$f":"(M179-K179)/(M172-K172)*(L172-K172)+K179","v":9999.9},10000.200000000001,{"$f":"(O179-M179)/(O172-M172)*(N172-M172)+M179","v":10000.050000000003},10000.299999999999,{"$f":"(Q179-O179)/(Q172-O172)*(P172-O172)+O179","v":10000.199999999999},10000.4,null,{"$f":"Лист1!B17*10","v":0.1},{"$f":"DIMENSIONAMENTO!$D$12","v":3000},{"$f":"VLOOKUP(S179,A172:Q193,HLOOKUP(V179,A172:Q193,22,0),0)","v":{"$error":"#N/A"}},{"$f":"DIMENSIONAMENTO!$E$21","v":100},{"$f":"IF(S179<A175,\"NO\",IF(S179>A189,\"NO\",IF(VLOOKUP(S179,A175:Q189,3,0)>T179,\"NO\",IF(VLOOKUP(S179,A175:Q189,17,0)<T179,\"NO\",IF(AND(U179>=T179-0.1,U179<T179+0.1)=TRUE,V179,\"NO\")))))","v":"NO"},"FA-12-AP/",200]
[{"$f":"IF(AND(S179>A179,S179<A181)=TRUE,S179,0)","v":0},null,{"$f":"(C181-C179)/(A181-A179)*(A180-A179)+C179","v":2500},{"$f":"(E180-C180)/(E172-C172)*(D172-C172)+C180","v":1388.8888888888887},{"$f":"(E181-E179)/(A181-A179)*(A180-A179)+E179","v":4166.666666666667},{"$f":"(G180-E180)/(G172-E172)*(F172-E172)+E180","v":2333.3333333333339},{"$f":"(G181-G179)/(A181-A179)*(A180-A179)+G179","v":6000},{"$f":"(I180-G180)/(I172-G172)*(H172-G172)+G180","v":4666.6666666666679},{"$f":"(I181-I179)/(A181-A179)*(A180-A179)+I179","v":6666.6666666666661},{"$f":"(K180-I180)/(K172-I172)*(J172-I172)+I180","v":16666.166666666661},{"$f":"(K181-K179)/(A181-A179)*(A180-A179)+K179","v":3333.5000000000009},{"$f":"(M180-K180)/(M172-K172)*(L172-K172)+K180","v":3333.2999999999984},{"$f":"(M181-M179)/(A181-A179)*(A180-A179)+M179","v":3333.6000000000022},{"$f":"(O180-M180)/(O172-M172)*(N172-M172)+M180","v":3333.4500000000085},{"$f":"(O181-O179)/(A181-A179)*(A180-A179)+O179","v":3333.699999999998},{"$f":"(Q180-O180)/(Q172-O172)*(P172-O172)+O180","v":3333.5999999999958},{"$f":"(Q181-Q179)/(A181-A179)*(A180-A179)+Q179","v":3333.8}]
[5,null,5000,{"$f":"(E181-C181)/(E172-C172)*(D172-C172)+C181","v":3333.3333333333335},7500,{"$f":"(G181-E181)/(G172-E172)*(F172-E172)+E181","v":4000},11000,{"$f":"(I181-G181)/(I172-G172)*(H172-G172)+G181","v":3000},15000,{"$f":"(K181-I181)/(K172-I172)*(J172-I172)+I181","v":0},20000,{"$f":"(M181-K181)/(M172-K172)*(L172-K172)+K181","v":19999.800000000003},20000.099999999999,{"$f":"(O181-M181)/(O172-M172)*(N172-M172)+M181","v":19999.949999999997},20000.2,{"$f":"(Q181-O181)/(Q172-O172)*(P172-O172)+O181","v":20000.100000000002},20000.3]
[{"$f":"IF(AND(S179>A181,S179<A183)=TRUE,S179,0)","v":0},null,{"$f":"(C183-C181)/(A183-A181)*(A182-A181)+C181","v":3000},{"$f":"(E182-C182)/(E172-C172)*(D172-C172)+C182","v":1666.6666666666665},{"$f":"(E183-E181)/(A183-A181)*(A182-A181)+E181","v":5000},{"$f":"(G182-E182)/(G172-E172)*(F172-E172)+E182","v":4000},{"$f":"(G183-G181)/(A183-A181)*(A182-A181)+G181","v":6000},{"$f":"(I182-G182)/(I172-G172)*(H172-G172)+G182","v":-6000},{"$f":"(I183-I181)/(A183-A181)*(A182-A181)+I181","v":12000},{"$f":"(K182-I182)/(K172-I172)*(J172-I172)+I182","v":-6000},{"$f":"(K183-K181)/(A183-A181)*(A182-A181)+K181","v":18000},{"$f":"(M182-K182)/(M172-K172)*(L172-K172)+K182","v":25999.600000000006},{"$f":"(M183-M181)/(A183-A181)*(A182-A181)+M181","v":14000.199999999997},{"$f":"(O182-M182)/(O172-M172)*(N172-M172)+M182","v":27499.899999999991},{"$f":"(O183-O181)/(A183-A181)*(A182-A181)+O181","v":5000.4000000000015},{"$f":"(Q182-O182)/(Q172-O172)*(P172-O172)+O182","v":5000.2000000000044},{"$f":"(Q183-Q181)/(A183-A181)*(A182-A181)+Q181","v":5000.5999999999985}]
[10,null,7000,{"$f":"(E183-C183)/(E172-C172)*(D172-C172)+C183","v":5000},10000,{"$f":"(G183-E183)/(G172-E172)*(F172-E172)+E183","v":4000},16000,{"$f":"(I183-G183)/(I172-G172)*(H172-G172)+G183","v":12000},18000,{"$f":"(K183-I183)/(K172-I172)*(J172-I172)+I183","v":6000},22000,{"$f":"(M183-K183)/(M172-K172)*(L172-K172)+K183","v":14000},26000,{"$f":"(O183-M183)/(O172-M172)*(N172-M172)+M183","v":12500},35000,{"$f":"(Q183-O183)/(Q172-O172)*(P172-O172)+O183","v":35000},35000]
[{"$f":"IF(AND(S179>A183,S179<A185)=TRUE,S179,0)","v":0},null,{"$f":"(C185-C183)/(A185-A183)*(A184-A183)+C183","v":5000},{"$f":"(E184-C184)/(E172-C172)*(D172-C172)+C184","v":4333.333333333333},{"$f":"(E185-E183)/(A185-A183)*(A184-A183)+E183","v":6000},{"$f":"(G184-E184)/(G172-E172)*(F172-E172)+E184","v":1333.3333333333339},{"$f":"(G185-G183)/(A185-A183)*(A184-A183)+G183","v":10666.666666666666},{"$f":"(I184-G184)/(I172-G172)*(H172-G172)+G184","v":27200},2400,{"$f":"(K184-I184)/(K172-I172)*(J172-I172)+I184","v":-32400},{"$f":"(K185-K183)/(A185-A183)*(A184-A183)+K183","v":14000},{"$f":"(M184-K184)/(M172-K172)*(L172-K172)+K184","v":8666.6666666666715},{"$f":"(M185-M183)/(A185-A183)*(A184-A183)+M183","v":16666.666666666664},{"$f":"(O184-M184)/(O172-M172)*(N172-M172)+M184","v":4166.6666666666606},{"$f":"(O185-O183)/(A185-A183)*(A184-A183)+O183","v":25000},{"$f":"(Q184-O184)/(Q172-O172)*(P172-O172)+O184","v":39666.666666666664},{"$f":"(Q185-Q183)/(A185-A183)*(A184-A183)+Q183","v":10333.333333333336}]
[25,null,10000,{"$f":"(E185-C185)/(E172-C172)*(D172-C172)+C185","v":6000},16000,{"$f":"(G185-E185)/(G172-E172)*(F172-E172)+E185","v":8000},24000,{"$f":"(I185-G185)/(I172-G172)*(H172-G172)+G185","v":12000},30000,{"$f":"(K185-I185)/(K172-I172)*(J172-I172)+I185","v":18000},34000,{"$f":"(M185-K185)/(M172-K172)*(L172-K172)+K185","v":22000},40000,{"$f":"(O185-M185)/(O172-M172)*(N172-M172)+M185","v":25000},50000,{"$f":"(Q185-O185)/(Q172-O172)*(P172-O172)+O185","v":28000},72000]
[{"$f":"IF(AND(S181>A185,S181<A187)=TRUE,S181,0)","v":0},null,{"$f":"(C187-C185)/(A187-A185)*(A186-A185)+C185","v":5000},{"$f":"(E186-C186)/(E172-C172)*(D172-C172)+C186","v":1000},{"$f":"(E187-E185)/(A187-A185)*(A186-A185)+E185","v":11000},{"$f":"(G186-E186)/(G172-E172)*(F172-E172)+E186","v":-333.33333333333212},{"$f":"(G187-G185)/(A187-A185)*(A186-A185)+G185","v":22333.333333333332},{"$f":"(I186-G186)/(I172-G172)*(H172-G172)+G186","v":62200},2400,{"$f":"(K186-I186)/(K172-I172)*(J172-I172)+I186","v":-62400},{"$f":"(K187-K185)/(A187-A185)*(A186-A185)+K185","v":24000},{"$f":"(M186-K186)/(M172-K172)*(L172-K172)+K186","v":32000},{"$f":"(M187-M185)/(A187-A185)*(A186-A185)+M185","v":20000},{"$f":"(O186-M186)/(O172-M172)*(N172-M172)+M186","v":12500},{"$f":"(O187-O185)/(A187-A185)*(A186-A185)+O185","v":25000},{"$f":"(Q186-O186)/(Q172-O172)*(P172-O172)+O186","v":8000},{"$f":"(Q187-Q185)/(A187-A185)*(A186-A185)+Q185","v":42000}]
[40,null,13000,{"$f":"(E187-C187)/(E172-C172)*(D172-C172)+C187","v":9000},19000,{"$f":"(G187-E187)/(G172-E172)*(F172-E172)+E187","v":13000},25000,{"$f":"(I187-G187)/(I172-G172)*(H172-G172)+G187","v":9000},33000,{"$f":"(K187-I187)/(K172-I172)*(J172-I172)+I187","v":12000},40000,{"$f":"(M187-K187)/(M172-K172)*(L172-K172)+K187","v":16000},52000,{"$f":"(O187-M187)/(O172-M172)*(N172-M172)+M187","v":32500},65000,{"$f":"(Q187-O187)/(Q172-O172)*(P172-O172)+O187","v":40000},90000]
[{"$f":"IF(AND(S183>A187,S183<A189)=TRUE,S183,0)","v":0},null,{"$f":"(C189-C187)/(A189-A187)*(A188-A187)+C187","v":9000},{"$f":"(E188-C188)/(E176-C176)*(D176-C176)+C188","v":5888.8888888888896},{"$f":"(E189-E187)/(A189-A187)*(A188-A187)+E187","v":13666.666666666666},{"$f":"(G188-E188)/(G176-E176)*(F176-E176)+E188","v":10333.333333333332},{"$f":"(G189-G187)/(A189-A187)*(A188-A187)+G187","v":17000},{"$f":"(I188-G188)/(I176-G176)*(H176-G176)+G188","v":46200},2400,{"$f":"(K188-I188)/(K176-I176)*(J176-I176)+I188","v":-30400.000000000007},{"$f":"(K189-K187)/(A189-A187)*(A188-A187)+K187","v":13333.333333333336},{"$f":"(M188-K188)/(M176-K176)*(L176-K176)+K188","v":-2666.6666666666642},{"$f":"(M189-M187)/(A189-A187)*(A188-A187)+M187","v":21333.333333333336},{"$f":"(O188-M188)/(O176-M176)*(N176-M176)+M188","v":5833.333333333343},{"$f":"(O189-O187)/(A189-A187)*(A188-A187)+O187","v":31666.666666666664},{"$f":"(Q188-O188)/(Q176-O176)*(P176-O176)+O188","v":20000},{"$f":"(Q189-Q187)/(A189-A187)*(A188-A187)+Q187","v":43333.333333333328}]
[70,null,16000,{"$f":"(E189-C189)/(E176-C176)*(D176-C176)+C189","v":11333.333333333332},23000,{"$f":"(G189-E189)/(G176-E176)*(F176-E176)+E189","v":15000},31000,{"$f":"(I189-G189)/(I176-G176)*(H176-G176)+G189","v":3000},45000,{"$f":"(K189-I189)/(K176-I176)*(J176-I176)+I189","v":0},60000,{"$f":"(M189-K189)/(M176-K176)*(L176-K176)+K189","v":30000},75000,{"$f":"(O189-M189)/(O176-M176)*(N176-M176)+M189","v":52500},90000,{"$f":"(Q189-O189)/(Q176-O176)*(P176-O176)+O189","v":55000},125000,null,null,null,"VALORI LIMITE"]
[]
[]
[]
["COL",null,3,4,5,6,7,8,9,10,11,12,13,14,15,16,17]
[]
[]
[null,"DP",10,{"$f":"IF(AND(V203>C196,V203<E196)=TRUE,V203,0)","v":0},25,{"$f":"IF(AND(V203>E196,V203<G196)=TRUE,V203,0)","v":0},50,{"$f":"IF(AND(V203>G196,V203<I196)=TRUE,V203,0)","v":0},75,{"$f":"IF(AND(V203>I196,V203<K196)=TRUE,V203,0)","v":0},100,{"$f":"IF(AND(V203>K196,V203<M196)=TRUE,V203,0)","v":0},150,{"$f":"IF(AND(V203>M196,V203<O196)=TRUE,V203,0)","v":0},250,{"$f":"IF(AND(V203>O196,V203<Q196)=TRUE,V203,0)","v":0},500]
["PM"]
[]
[0.5,null,4500,{"$f":"(E199-C199)/(E196-C196)*(D196-C196)+C199","v":2833.3333333333335},7000,{"$f":"(G199-E199)/(G196-E196)*(F196-E196)+E199","v":6000},8000,{"$f":"(I199-G199)/(I196-G196)*(H196-G196)+G199","v":7999.7999999999993},8000.1,{"$f":"(K199-I199)/(K196-I196)*(J196-I196)+I199","v":7999.800000000002},8000.2,{"$f":"(M199-K199)/(M196-K196)*(L196-K196)+K199","v":7999.9999999999991},8000.3,{"$f":"(O199-M199)/(O196-M196)*(N196-M196)+M199","v":8000.1500000000015},8000.4,{"$f":"(Q199-O199)/(Q196-O196)*(P196-O196)+O199","v":8000.3099999999995},8000.49,null,"PM","Q","Qcal","DPcal","DP","TIPO"]
[{"$f":"IF(AND(S203>A199,S203<A201)=TRUE,S203,0)","v":0},null,{"$f":"(C201-C199)/(A201-A199)*(A200-A199)+C199","v":3500},{"$f":"(E200-C200)/(E196-C196)*(D196-C196)+C200","v":1833.3333333333335},{"$f":"(E201-E199)/(A201-A199)*(A200-A199)+E199","v":6000},{"$f":"(G200-E200)/(G196-E196)*(F196-E196)+E200","v":6000},{"$f":"(G201-G199)/(A201-A199)*(A200-A199)+G199","v":6000},{"$f":"(I200-G200)/(I196-G196)*(H196-G196)+G200","v":5999.7999999999993},{"$f":"(I201-I199)/(A201-A199)*(A200-A199)+I199","v":6000.1},{"$f":"(K200-I200)/(K196-I196)*(J196-I196)+I200","v":5999.8000000000047},{"$f":"(K201-K199)/(A201-A199)*(A200-A199)+K199","v":6000.1999999999989},{"$f":"(M200-K200)/(M196-K196)*(L196-K196)+K200","v":5999.9999999999945},{"$f":"(M201-M199)/(A201-A199)*(A200-A199)+M199","v":6000.3000000000011},{"$f":"(O200-M200)/(O196-M196)*(N196-M196)+M200","v":6000.1500000000033},{"$f":"(O201-O199)/(A201-A199)*(A200-A199)+O199","v":6000.4},{"$f":"(Q200-O200)/(Q196-O196)*(P196-O196)+O200","v":6000.3099999999995},{"$f":"(Q201-Q199)/(A201-A199)*(A200-A199)+Q199","v":6000.49}]
[1,null,5500,{"$f":"(E201-C201)/(E196-C196)*(D196-C196)+C201","v":3833.3333333333335},8000,{"$f":"(G201-E201)/(G196-E196)*(F196-E196)+E201","v":6000},10000,{"$f":"(I201-G201)/(I196-G196)*(H196-G196)+G201","v":9999.7999999999993},10000.1,{"$f":"(K201-I201)/(K196-I196)*(J196-I196)+I201","v":9999.7999999999993},10000.200000000001,{"$f":"(M201-K201)/(M196-K196)*(L196-K196)+K201","v":10000.000000000004},10000.299999999999,{"$f":"(O201-M201)/(O196-M196)*(N196-M196)+M201","v":10000.149999999998},10000.4,{"$f":"(Q201-O201)/(Q196-O196)*(P196-O196)+O201","v":10000.31},10000.49,null,null,"Stmc/h","Stmc/h","Mbar","Mbar"]
[{"$f":"IF(AND(S203>A201,S203<A203)=TRUE,S203,0)","v":0},null,{"$f":"(C203-C201)/(A203-A201)*(A202-A201)+C201","v":4500},{"$f":"(E202-C202)/(E196-C196)*(D196-C196)+C202","v":3500},{"$f":"(E203-E201)/(A203-A201)*(A202-A201)+E201","v":6000},{"$f":"(G202-E202)/(G196-E196)*(F196-E196)+E202","v":7000},{"$f":"(G203-G201)/(A203-A201)*(A202-A201)+G201","v":5000},{"$f":"(I202-G202)/(I196-G196)*(H196-G196)+G202","v":4999.7999999999993},{"$f":"(I203-I201)/(A203-A201)*(A202-A201)+I201","v":5000.1000000000004},{"$f":"(K202-I202)/(K196-I196)*(J196-I196)+I202","v":4999.7999999999993},{"$f":"(K203-K201)/(A203-A201)*(A202-A201)+K201","v":5000.2000000000007},{"$f":"(M202-K202)/(M196-K196)*(L196-K196)+K202","v":5000.0000000000036},{"$f":"(M203-M201)/(A203-A201)*(A202-A201)+M201","v":5000.2999999999993},{"$f":"(O202-M202)/(O196-M196)*(N196-M196)+M202","v":5000.1499999999987},{"$f":"(O203-O201)/(A203-A201)*(A202-A201)+O201","v":5000.3999999999996},{"$f":"(Q202-O202)/(Q196-O196)*(P196-O196)+O202","v":5000.3099999999995},{"$f":"(Q203-Q201)/(A203-A201)*(A202-A201)+Q201","v":5000.49}]
[2,null,6500,{"$f":"(E203-C203)/(E196-C196)*(D196-C196)+C203","v":4166.6666666666661},10000,{"$f":"(G203-E203)/(G196-E196)*(F196-E196)+E203","v":5000},15000,{"$f":"(I203-G203)/(I196-G196)*(H196-G196)+G203","v":14999.8},15000.1,{"$f":"(K203-I203)/(K196-I196)*(J196-I196)+I203","v":14999.8},15000.2,{"$f":"(M203-K203)/(M196-K196)*(L196-K196)+K203","v":15000.000000000004},15000.3,{"$f":"(O203-M203)/(O196-M196)*(N196-M196)+M203","v":15000.149999999998},15000.4,{"$f":"(Q203-O203)/(Q196-O196)*(P196-O196)+O203","v":15000.31},15000.49,null,{"$f":"DIMENSIONAMENTO!$F$21","v":6},{"$f":"DIMENSIONAMENTO!$D$12","v":3000},{"$f":"VLOOKUP(S203,A196:Q217,HLOOKUP(V203,A196:Q217,22,0),0)","v":32000.079999999998},{"$f":"DIMENSIONAMENTO!$E$21","v":100},{"$f":"IF(S203<A199,\"NO\",IF(S203>A213,\"NO\",IF(VLOOKUP(S203,A199:Q213,3,0)>T203,\"NO\",IF(VLOOKUP(S203,A199:Q213,17,0)<T203,\"NO\",IF(AND(U203>=T203-0.1,U203<T203+0.1)=TRUE,V203,\"NO\")))))","v":"NO"},"FA-12-AP/",250]
[{"$f":"IF(AND(S203>A203,S203<A205)=TRUE,S203,0)","v":0},null,{"$f":"(C205-C203)/(A205-A203)*(A204-A203)+C203","v":4500},{"$f":"(E204-C204)/(E196-C196)*(D196-C196)+C204","v":2611.1111111111104},{"$f":"(E205-E203)/(A205-A203)*(A204-A203)+E203","v":7333.3333333333339},{"$f":"(G204-E204)/(G196-E196)*(F196-E196)+E204","v":3000.0000000000018},{"$f":"(G205-G203)/(A205-A203)*(A204-A203)+G203","v":11666.666666666666},{"$f":"(I204-G204)/(I196-G196)*(H196-G196)+G204","v":24999.666666666664},{"$f":"(I205-I203)/(A205-A203)*(A204-A203)+I203","v":5000.1666666666679},{"$f":"(K204-I204)/(K196-I196)*(J196-I196)+I204","v":4999.8666666666668},{"$f":"(K205-K203)/(A205-A203)*(A204-A203)+K203","v":5000.2666666666682},{"$f":"(M204-K204)/(M196-K196)*(L196-K196)+K204","v":5000.0666666666748},{"$f":"(M205-M203)/(A205-A203)*(A204-A203)+M203","v":5000.366666666665},{"$f":"(O204-M204)/(O196-M196)*(N196-M196)+M204","v":5000.2166666666617},{"$f":"(O205-O203)/(A205-A203)*(A204-A203)+O203","v":5000.4666666666672},{"$f":"(Q204-O204)/(Q196-O196)*(P196-O196)+O204","v":5000.383333333335},{"$f":"(Q205-Q203)/(A205-A203)*(A204-A203)+Q203","v":5000.5499999999993}]
[5,null,9500,{"$f":"(E205-C205)/(E196-C196)*(D196-C196)+C205","v":6500},14000,{"$f":"(G205-E205)/(G196-E196)*(F196-E196)+E205","v":8000},20000,{"$f":"(I205-G205)/(I196-G196)*(H196-G196)+G205","v":0},30000,{"$f":"(K205-I205)/(K196-I196)*(J196-I196)+I205","v":29999.700000000004},30000.1,{"$f":"(M205-K205)/(M196-K196)*(L196-K196)+K205","v":29999.899999999994},30000.2,{"$f":"(O205-M205)/(O196-M196)*(N196-M196)+M205","v":30000.050000000003},30000.3,{"$f":"(Q205-O205)/(Q196-O196)*(P196-O196)+O205","v":30000.199999999997},30000.400000000001]
[{"$f":"IF(AND(S203>A205,S203<A207)=TRUE,S203,0)","v":6},null,{"$f":"(C207-C205)/(A207-A205)*(A206-A205)+C205","v":10200},{"$f":"(E206-C206)/(E196-C196)*(D196-C196)+C206","v":6866.666666666667},{"$f":"(E207-E205)/(A207-A205)*(A206-A205)+E205","v":15200},{"$f":"(G206-E206)/(G196-E196)*(F196-E196)+E206","v":8400},{"$f":"(G207-G205)/(A207-A205)*(A206-A205)+G205","v":22000},{"$f":"(I206-G206)/(I196-G196)*(H196-G196)+G206","v":3600},{"$f":"(I207-I205)/(A207-A205)*(A206-A205)+I205","v":31200},{"$f":"(K206-I206)/(K196-I196)*(J196-I196)+I206","v":28799.760000000006},{"$f":"(K207-K205)/(A207-A205)*(A206-A205)+K205","v":32000.079999999998},{"$f":"(M206-K206)/(M196-K196)*(L196-K196)+K206","v":29999.919999999987},{"$f":"(M207-M205)/(A207-A205)*(A206-A205)+M205","v":33000.160000000003},{"$f":"(O206-M206)/(O196-M196)*(N196-M196)+M206","v":30000.040000000012},{"$f":"(O207-O205)/(A207-A205)*(A206-A205)+O205","v":35000.239999999998},{"$f":"(Q206-O206)/(Q196-O196)*(P196-O196)+O206","v":35000.139999999992},{"$f":"(Q207-Q205)/(A207-A205)*(A206-A205)+Q205","v":35000.340000000004}]
[10,null,13000,{"$f":"(E207-C207)/(E196-C196)*(D196-C196)+C207","v":8333.3333333333321},20000,{"$f":"(G207-E207)/(G196-E196)*(F196-E196)+E207","v":10000},30000,{"$f":"(I207-G207)/(I196-G196)*(H196-G196)+G207","v":18000},36000,{"$f":"(K207-I207)/(K196-I196)*(J196-I196)+I207","v":24000},40000,{"$f":"(M207-K207)/(M196-K196)*(L196-K196)+K207","v":30000},45000,{"$f":"(O207-M207)/(O196-M196)*(N196-M196)+M207","v":30000},55000,{"$f":"(Q207-O207)/(Q196-O196)*(P196-O196)+O207","v":54999.9},55000.1]
[{"$f":"IF(AND(S203>A207,S203<A209)=TRUE,S203,0)","v":0},null,{"$f":"(C209-C207)/(A209-A207)*(A208-A207)+C207","v":8333.3333333333321},{"$f":"(E208-C208)/(E196-C196)*(D196-C196)+C208","v":4999.9999999999982},{"$f":"(E209-E207)/(A209-A207)*(A208-A207)+E207","v":13333.333333333334},{"$f":"(G208-E208)/(G196-E196)*(F196-E196)+E208","v":6666.6666666666679},{"$f":"(G209-G207)/(A209-A207)*(A208-A207)+G207","v":20000},{"$f":"(I208-G208)/(I196-G196)*(H196-G196)+G208","v":55200},2400,{"$f":"(K208-I208)/(K196-I196)*(J196-I196)+I208","v":-62400},{"$f":"(K209-K207)/(A209-A207)*(A208-A207)+K207","v":24000},{"$f":"(M208-K208)/(M196-K196)*(L196-K196)+K208","v":23333.333333333328},{"$f":"(M209-M207)/(A209-A207)*(A208-A207)+M207","v":24333.333333333336},{"$f":"(O208-M208)/(O196-M196)*(N196-M196)+M208","v":13333.333333333343},{"$f":"(O209-O207)/(A209-A207)*(A208-A207)+O207","v":31666.666666666664},{"$f":"(Q208-O208)/(Q196-O196)*(P196-O196)+O208","v":58333.166666666657},{"$f":"(Q209-Q207)/(A209-A207)*(A208-A207)+Q207","v":5000.1666666666715}]
[25,null,20000,{"$f":"(E209-C209)/(E196-C196)*(D196-C196)+C209","v":13333.333333333334},30000,{"$f":"(G209-E209)/(G196-E196)*(F196-E196)+E209","v":15000},45000,{"$f":"(I209-G209)/(I196-G196)*(H196-G196)+G209","v":43000},46000,{"$f":"(K209-I209)/(K196-I196)*(J196-I196)+I209","v":-8000},64000,{"$f":"(M209-K209)/(M196-K196)*(L196-K196)+K209","v":40000},76000,{"$f":"(O209-M209)/(O196-M196)*(N196-M196)+M209","v":55000},90000,{"$f":"(Q209-O209)/(Q196-O196)*(P196-O196)+O209","v":50000},130000]
[{"$f":"IF(AND(S205>A209,S205<A211)=TRUE,S205,0)","v":0},null,{"$f":"(C211-C209)/(A211-A209)*(A210-A209)+C209","v":3333.3333333333358},{"$f":"(E210-C210)/(E196-C196)*(D196-C196)+C210","v":-3333.3333333333303},{"$f":"(E211-E209)/(A211-A209)*(A210-A209)+E209","v":13333.333333333336},{"$f":"(G210-E210)/(G196-E196)*(F196-E196)+E210","v":-1666.6666666666642},{"$f":"(G211-G209)/(A211-A209)*(A210-A209)+G209","v":28333.333333333336},{"$f":"(I210-G210)/(I196-G196)*(H196-G196)+G210","v":80200},2400,{"$f":"(K210-I210)/(K196-I196)*(J196-I196)+I210","v":-77400},{"$f":"(K211-K209)/(A211-A209)*(A210-A209)+K209","v":29000},{"$f":"(M210-K210)/(M196-K196)*(L196-K196)+K210","v":15000},{"$f":"(M211-M209)/(A211-A209)*(A210-A209)+M209","v":36000},{"$f":"(O210-M210)/(O196-M196)*(N196-M196)+M210","v":30000},{"$f":"(O211-O209)/(A211-A209)*(A210-A209)+O209","v":40000},{"$f":"(Q210-O210)/(Q196-O196)*(P196-O196)+O210","v":25000},{"$f":"(Q211-Q209)/(A211-A209)*(A210-A209)+Q209","v":55000}]
[40,null,30000,{"$f":"(E211-C211)/(E196-C196)*(D196-C196)+C211","v":23333.333333333336},40000,{"$f":"(G211-E211)/(G196-E196)*(F196-E196)+E211","v":25000},55000,{"$f":"(I211-G211)/(I196-G196)*(H196-G196)+G211","v":25000},70000,{"$f":"(K211-I211)/(K196-I196)*(J196-I196)+I211","v":25000},85000,{"$f":"(M211-K211)/(M196-K196)*(L196-K196)+K211","v":55000},100000,{"$f":"(O211-M211)/(O196-M196)*(N196-M196)+M211","v":70000},120000,{"$f":"(Q211-O211)/(Q196-O196)*(P196-O196)+O211","v":65000},175000]
[{"$f":"IF(AND(S207>A211,S207<A213)=TRUE,S207,0)","v":0},null,{"$f":"(C213-C211)/(A213-A211)*(A212-A211)+C211","v":16666.666666666668},{"$f":"(E212-C212)/(E200-C200)*(D200-C200)+C212","v":18888.888888888891},{"$f":"(E213-E211)/(A213-A211)*(A212-A211)+E211","v":13333.333333333336},{"$f":"(G212-E212)/(G200-E200)*(F200-E200)+E212","v":{"$error":"#DIV/0!"}},{"$f":"(G213-G211)/(A213-A211)*(A212-A211)+G211","v":21666.666666666664},{"$f":"(I212-G212)/(I200-G200)*(H200-G200)+G212","v":60199.999999999993},2400,{"$f":"(K212-I212)/(K200-I200)*(J200-I200)+I212","v":-105399.99999999999},{"$f":"(K213-K211)/(A213-A211)*(A212-A211)+K211","v":38333.333333333328},{"$f":"(M212-K212)/(M200-K200)*(L200-K200)+K212","v":34999.999999999985},{"$f":"(M213-M211)/(A213-A211)*(A212-A211)+M211","v":40000},{"$f":"(O212-M212)/(O200-M200)*(N200-M200)+M212","v":20000.000000000007},{"$f":"(O213-O211)/(A213-A211)*(A212-A211)+O211","v":53333.333333333328},{"$f":"(Q212-O212)/(Q200-O200)*(P200-O200)+O212","v":31666.666666666657},{"$f":"(Q213-Q211)/(A213-A211)*(A212-A211)+Q211","v":75000}]
[70,null,40000,{"$f":"(E213-C213)/(E200-C200)*(D200-C200)+C213","v":26666.666666666668},60000,{"$f":"(G213-E213)/(G200-E200)*(F200-E200)+E213","v":{"$error":"#DIV/0!"}},80000,{"$f":"(I213-G213)/(I200-G200)*(H200-G200)+G213","v":40000},100000,{"$f":"(K213-I213)/(K200-I200)*(J200-I200)+I213","v":40000},120000,{"$f":"(M213-K213)/(M200-K200)*(L200-K200)+K213","v":70000},145000,{"$f":"(O213-M213)/(O200-M200)*(N200-M200)+M213","v":107500},170000,{"$f":"(Q213-O213)/(Q200-O200)*(P200-O200)+O213","v":90000},250000,null,null,null,"VALORI LIMITE"]
[]
[]
[]
["COL",null,3,4,5,6,7,8,9,10,11,12,13,14,15,16,17]
[]
[]
[null,"DP",10,{"$f":"IF(AND(V227>C220,V227<E220)=TRUE,V227,0)","v":0},25,{"$f":"IF(AND(V227>E220,V227<G220)=TRUE,V227,0)","v":0},50,{"$f":"IF(AND(V227>G220,V227<I220)=TRUE,V227,0)","v":0},75,{"$f":"IF(AND(V227>I220,V227<K220)=TRUE,V227,0)","v":0},100,{"$f":"IF(AND(V227>K220,V227<M220)=TRUE,V227,0)","v":0},150,{"$f":"IF(AND(V227>M220,V227<O220)=TRUE,V227,0)","v":0},250,{"$f":"IF(AND(V227>O220,V227<Q220)=TRUE,V227,0)","v":0},500]
["PM"]
[]
[0.5,null,8000,{"$f":"(E223-C223)/(E220-C220)*(D220-C220)+C223","v":5666.6666666666661},11500,{"$f":"(G223-E223)/(G220-E220)*(F220-E220)+E223","v":11499.95},11500.05,{"$f":"(I223-G223)/(I220-G220)*(H220-G220)+G223","v":11499.949999999997},11500.1,{"$f":"(K223-I223)/(K220-I220)*(J220-I220)+I223","v":11499.8},11500.2,{"$f":"(M223-K223)/(M220-K220)*(L220-K220)+K223","v":11500.000000000004},11500.3,{"$f":"(O223-M223)/(O220-M220)*(N220-M220)+M223","v":11500.149999999998},11500.4,{"$f":"(Q223-O223)/(Q220-O220)*(P220-O220)+O223","v":11500.31},11500.49,null,"PM","Q","Qcal","DPcal","DP","TIPO"]
[{"$f":"IF(AND(S227>A223,S227<A225)=TRUE,S227,0)","v":0},null,{"$f":"(C225-C223)/(A225-A223)*(A224-A223)+C223","v":7000},{"$f":"(E224-C224)/(E220-C220)*(D220-C220)+C224","v":6333.333333333333},{"$f":"(E225-E223)/(A225-A223)*(A224-A223)+E223","v":8000},{"$f":"(G224-E224)/(G220-E220)*(F220-E220)+E224","v":7999.9500000000007},{"$f":"(G225-G223)/(A225-A223)*(A224-A223)+G223","v":8000.0499999999993},{"$f":"(I224-G224)/(I220-G220)*(H220-G220)+G224","v":7999.9499999999971},{"$f":"(I225-I223)/(A225-A223)*(A224-A223)+I223","v":8000.1},{"$f":"(K224-I224)/(K220-I220)*(J220-I220)+I224","v":7999.7999999999993},{"$f":"(K225-K223)/(A225-A223)*(A224-A223)+K223","v":8000.2000000000007},{"$f":"(M224-K224)/(M220-K220)*(L220-K220)+K224","v":8000.0000000000036},{"$f":"(M225-M223)/(A225-A223)*(A224-A223)+M223","v":8000.2999999999993},{"$f":"(O224-M224)/(O220-M220)*(N220-M220)+M224","v":8000.1499999999987},{"$f":"(O225-O223)/(A225-A223)*(A224-A223)+O223","v":8000.4},{"$f":"(Q224-O224)/(Q220-O220)*(P220-O220)+O224","v":8000.3099999999995},{"$f":"(Q225-Q223)/(A225-A223)*(A224-A223)+Q223","v":8000.49}]
[1,null,9000,{"$f":"(E225-C225)/(E220-C220)*(D220-C220)+C225","v":5000},15000,{"$f":"(G225-E225)/(G220-E220)*(F220-E220)+E225","v":14999.95},15000.05,{"$f":"(I225-G225)/(I220-G220)*(H220-G220)+G225","v":14999.949999999997},15000.1,{"$f":"(K225-I225)/(K220-I220)*(J220-I220)+I225","v":14999.8},15000.2,{"$f":"(M225-K225)/(M220-K220)*(L220-K220)+K225","v":15000.000000000004},15000.3,{"$f":"(O225-M225)/(O220-M220)*(N220-M220)+M225","v":15000.149999999998},15000.4,{"$f":"(Q225-O225)/(Q220-O220)*(P220-O220)+O225","v":15000.31},15000.49,null,null,"Stmc/h","Stmc/h","Mbar","Mbar"]
[{"$f":"IF(AND(S227>A225,S227<A227)=TRUE,S227,0)","v":0},null,{"$f":"(C227-C225)/(A227-A225)*(A226-A225)+C225","v":6000},{"$f":"(E226-C226)/(E220-C220)*(D220-C220)+C226","v":2000},{"$f":"(E227-E225)/(A227-A225)*(A226-A225)+E225","v":12000},{"$f":"(G226-E226)/(G220-E220)*(F220-E220)+E226","v":16999.900000000001},{"$f":"(G227-G225)/(A227-A225)*(A226-A225)+G225","v":7000.0999999999985},{"$f":"(I226-G226)/(I220-G220)*(H220-G220)+G226","v":7000.0999999999913},{"$f":"(I227-I225)/(A227-A225)*(A226-A225)+I225","v":7000.1000000000022},{"$f":"(K226-I226)/(K220-I220)*(J220-I220)+I226","v":6999.8000000000065},{"$f":"(K227-K225)/(A227-A225)*(A226-A225)+K225","v":7000.2000000000007},{"$f":"(M226-K226)/(M220-K220)*(L220-K220)+K226","v":7000.0000000000036},{"$f":"(M227-M225)/(A227-A225)*(A226-A225)+M225","v":7000.2999999999993},{"$f":"(O226-M226)/(O220-M220)*(N220-M220)+M226","v":7000.1500000000015},{"$f":"(O227-O225)/(A227-A225)*(A226-A225)+O225","v":7000.3999999999978},{"$f":"(Q226-O226)/(Q220-O220)*(P220-O220)+O226","v":7000.3099999999977},{"$f":"(Q227-Q225)/(A227-A225)*(A226-A225)+Q225","v":7000.489999999998}]
[2,null,12000,{"$f":"(E227-C227)/(E220-C220)*(D220-C220)+C227","v":8000},18000,{"$f":"(G227-E227)/(G220-E220)*(F220-E220)+E227","v":13000},23000,{"$f":"(I227-G227)/(I220-G220)*(H220-G220)+G227","v":22999.800000000003},23000.1,{"$f":"(K227-I227)/(K220-I220)*(J220-I220)+I227","v":22999.799999999992},23000.2,{"$f":"(M227-K227)/(M220-K220)*(L220-K220)+K227","v":23000.000000000004},23000.3,{"$f":"(O227-M227)/(O220-M220)*(N220-M220)+M227","v":23000.149999999994},23000.400000000001,{"$f":"(Q227-O227)/(Q220-O220)*(P220-O220)+O227","v":23000.31},23000.49,null,{"$f":"Лист1!B17*10","v":0.1},{"$f":"Лист1!B19","v":3500},{"$f":"VLOOKUP(S227,A220:Q241,HLOOKUP(V227,A220:Q241,22,0),0)","v":{"$error":"#N/A"}},{"$f":"Лист1!B18*10","v":100},{"$f":"IF(S227<A223,\"NO\",IF(S227>A237,\"NO\",IF(VLOOKUP(S227,A223:Q237,3,0)>T227,\"NO\",IF(VLOOKUP(S227,A223:Q237,17,0)<T227,\"NO\",IF(AND(U227>=T227-0.1,U227<T227+0.1)=TRUE,V227,\"NO\")))))","v":"NO"},"Фильтр газовый",{"$f":"Лист1!F18","v":"РЕД-С-5-2-300 DN300"}]
[{"$f":"IF(AND(S227>A227,S227<A229)=TRUE,S227,0)","v":0},null,{"$f":"(C229-C227)/(A229-A227)*(A228-A227)+C227","v":8666.6666666666661},{"$f":"(E228-C228)/(E220-C220)*(D220-C220)+C228","v":5999.9999999999982},{"$f":"(E229-E227)/(A229-A227)*(A228-A227)+E227","v":12666.666666666668},{"$f":"(G228-E228)/(G220-E220)*(F220-E220)+E228","v":10333.333333333336},{"$f":"(G229-G227)/(A229-A227)*(A228-A227)+G227","v":15000},{"$f":"(I228-G228)/(I220-G220)*(H220-G220)+G228","v":28333.133333333339},{"$f":"(I229-I227)/(A229-A227)*(A228-A227)+I227","v":8333.4333333333325},{"$f":"(K228-I228)/(K220-I220)*(J220-I220)+I228","v":8333.1333333333205},{"$f":"(K229-K227)/(A229-A227)*(A228-A227)+K227","v":8333.5333333333365},{"$f":"(M228-K228)/(M220-K220)*(L220-K220)+K228","v":8333.200000000008},{"$f":"(M229-M227)/(A229-A227)*(A228-A227)+M227","v":8333.7000000000007},{"$f":"(O228-M228)/(O220-M220)*(N220-M220)+M228","v":8333.5499999999993},{"$f":"(O229-O227)/(A229-A227)*(A228-A227)+O227","v":8333.8000000000011},{"$f":"(Q228-O228)/(Q220-O220)*(P220-O220)+O228","v":8333.7166666666672},{"$f":"(Q229-Q227)/(A229-A227)*(A228-A227)+Q227","v":8333.883333333335}]
[5,null,17000,{"$f":"(E229-C229)/(E220-C220)*(D220-C220)+C229","v":11000},26000,{"$f":"(G229-E229)/(G220-E220)*(F220-E220)+E229","v":17000},35000,{"$f":"(I229-G229)/(I220-G220)*(H220-G220)+G229","v":14999.800000000003},45000.1,{"$f":"(K229-I229)/(K220-I220)*(J220-I220)+I229","v":44999.8},45000.2,{"$f":"(M229-K229)/(M220-K220)*(L220-K220)+K229","v":45000.2},45000.2,{"$f":"(O229-M229)/(O220-M220)*(N220-M220)+M229","v":45000.049999999988},45000.3,{"$f":"(Q229-O229)/(Q220-O220)*(P220-O220)+O229","v":45000.200000000004},45000.4]
[{"$f":"IF(AND(S227>A229,S227<A231)=TRUE,S227,0)","v":0},null,{"$f":"(C231-C229)/(A231-A229)*(A230-A229)+C229","v":10000},{"$f":"(E230-C230)/(E220-C220)*(D220-C220)+C230","v":6000},{"$f":"(E231-E229)/(A231-A229)*(A230-A229)+E229","v":16000},{"$f":"(G230-E230)/(G220-E220)*(F220-E220)+E230","v":16000},{"$f":"(G231-G229)/(A231-A229)*(A230-A229)+G229","v":16000},{"$f":"(I230-G230)/(I220-G220)*(H220-G220)+G230","v":-4000.3999999999942},{"$f":"(I231-I229)/(A231-A229)*(A230-A229)+I229","v":26000.199999999997},{"$f":"(K230-I230)/(K220-I220)*(J220-I220)+I230","v":43999.600000000006},{"$f":"(K231-K229)/(A231-A229)*(A230-A229)+K229","v":20000.399999999994},{"$f":"(M230-K230)/(M220-K220)*(L220-K220)+K230","v":50000.399999999994},{"$f":"(M231-M229)/(A231-A229)*(A230-A229)+M229","v":5000.3999999999942},{"$f":"(O230-M230)/(O220-M220)*(N220-M220)+M230","v":5000.2499999999854},{"$f":"(O231-O229)/(A231-A229)*(A230-A229)+O229","v":5000.5},{"$f":"(Q230-O230)/(Q220-O220)*(P220-O220)+O230","v":5000.3999999999942},{"$f":"(Q231-Q229)/(A231-A229)*(A230-A229)+Q229","v":5000.6000000000058}]
[10,null,24000,{"$f":"(E231-C231)/(E220-C220)*(D220-C220)+C231","v":16000},36000,{"$f":"(G231-E231)/(G220-E220)*(F220-E220)+E231","v":18000},54000,{"$f":"(I231-G231)/(I220-G220)*(H220-G220)+G231","v":34000},64000,{"$f":"(K231-I231)/(K220-I220)*(J220-I220)+I231","v":46000},70000,{"$f":"(M231-K231)/(M220-K220)*(L220-K220)+K231","v":40000},85000,{"$f":"(O231-M231)/(O220-M220)*(N220-M220)+M231","v":84999.849999999991},85000.1,{"$f":"(Q231-O231)/(Q220-O220)*(P220-O220)+O231","v":85000.000000000015},85000.2]
[{"$f":"IF(AND(S227>A231,S227<A233)=TRUE,S227,0)","v":0},null,{"$f":"(C233-C231)/(A233-A231)*(A232-A231)+C231","v":16666.666666666664},{"$f":"(E232-C232)/(E220-C220)*(D220-C220)+C232","v":11777.777777777774},{"$f":"(E233-E231)/(A233-A231)*(A232-A231)+E231","v":24000},{"$f":"(G232-E232)/(G220-E220)*(F220-E220)+E232","v":11333.333333333328},{"$f":"(G233-G231)/(A233-A231)*(A232-A231)+G231","v":36666.666666666672},{"$f":"(I232-G232)/(I220-G220)*(H220-G220)+G232","v":105200.00000000001},2400,{"$f":"(K232-I232)/(K220-I220)*(J220-I220)+I232","v":-120400.00000000001},{"$f":"(K233-K231)/(A233-A231)*(A232-A231)+K231","v":43333.333333333336},{"$f":"(M232-K232)/(M220-K220)*(L220-K220)+K232","v":33333.333333333336},{"$f":"(M233-M231)/(A233-A231)*(A232-A231)+M231","v":48333.333333333336},{"$f":"(O232-M232)/(O220-M220)*(N220-M220)+M232","v":78333.083333333328},{"$f":"(O233-O231)/(A233-A231)*(A232-A231)+O231","v":28333.500000000007},{"$f":"(Q232-O232)/(Q220-O220)*(P220-O220)+O232","v":48333.333333333358},{"$f":"(Q233-Q231)/(A233-A231)*(A232-A231)+Q231","v":8333.666666666657}]
[25,null,35000,{"$f":"(E233-C233)/(E220-C220)*(D220-C220)+C233","v":22333.333333333332},54000,{"$f":"(G233-E233)/(G220-E220)*(F220-E220)+E233","v":28000},80000,{"$f":"(I233-G233)/(I220-G220)*(H220-G220)+G233","v":40000},100000,{"$f":"(K233-I233)/(K220-I220)*(J220-I220)+I233","v":70000},110000,{"$f":"(M233-K233)/(M220-K220)*(L220-K220)+K233","v":50000},140000,{"$f":"(O233-M233)/(O220-M220)*(N220-M220)+M233","v":95000},170000,{"$f":"(Q233-O233)/(Q220-O220)*(P220-O220)+O233","v":140000},200000]
[{"$f":"IF(AND(S229>A233,S229<A235)=TRUE,S229,0)","v":0},null,{"$f":"(C235-C233)/(A235-A233)*(A234-A233)+C233","v":15000},{"$f":"(E234-C234)/(E220-C220)*(D220-C220)+C234","v":-4333.3333333333321},{"$f":"(E235-E233)/(A235-A233)*(A234-A233)+E233","v":44000},{"$f":"(G234-E234)/(G220-E220)*(F220-E220)+E234","v":-333.33333333332848},{"$f":"(G235-G233)/(A235-A233)*(A234-A233)+G233","v":88333.333333333328},{"$f":"(I234-G234)/(I220-G220)*(H220-G220)+G234","v":260200},2400,{"$f":"(K234-I234)/(K220-I220)*(J220-I220)+I234","v":-220400.00000000003},{"$f":"(K235-K233)/(A235-A233)*(A234-A233)+K233","v":76666.666666666672},{"$f":"(M234-K234)/(M220-K220)*(L220-K220)+K234","v":33333.333333333358},{"$f":"(M235-M233)/(A235-A233)*(A234-A233)+M233","v":98333.333333333328},{"$f":"(O234-M234)/(O220-M220)*(N220-M220)+M234","v":65833.333333333314},{"$f":"(O235-O233)/(A235-A233)*(A234-A233)+O233","v":120000},{"$f":"(Q234-O234)/(Q220-O220)*(P220-O220)+O234","v":206666.66666666669},{"$f":"(Q235-Q233)/(A235-A233)*(A234-A233)+Q233","v":33333.333333333314}]
[40,null,47000,{"$f":"(E235-C235)/(E220-C220)*(D220-C220)+C235","v":38333.333333333336},60000,{"$f":"(G235-E235)/(G220-E220)*(F220-E220)+E235","v":45000},75000,{"$f":"(I235-G235)/(I220-G220)*(H220-G220)+G235","v":25000},100000,{"$f":"(K235-I235)/(K220-I220)*(J220-I220)+I235","v":10000},130000,{"$f":"(M235-K235)/(M220-K220)*(L220-K220)+K235","v":60000},165000,{"$f":"(O235-M235)/(O220-M220)*(N220-M220)+M235","v":112500},200000,{"$f":"(Q235-O235)/(Q220-O220)*(P220-O220)+O235","v":100000},300000]
[{"$f":"IF(AND(S231>A235,S231<A237)=TRUE,S231,0)","v":0},null,{"$f":"(C237-C235)/(A237-A235)*(A236-A235)+C235","v":36333.333333333328},{"$f":"(E236-C236)/(E224-C224)*(D224-C224)+C236","v":29444.444444444431},{"$f":"(E237-E235)/(A237-A235)*(A236-A235)+E235","v":46666.666666666672},{"$f":"(G236-E236)/(G224-E224)*(F224-E224)+E236","v":38333.333333333343},{"$f":"(G237-G235)/(A237-A235)*(A236-A235)+G235","v":55000},{"$f":"(I236-G236)/(I224-G224)*(H224-G224)+G236","v":160200},2400,{"$f":"(K236-I236)/(K224-I224)*(J224-I224)+I236","v":-320400.00000000006},{"$f":"(K237-K235)/(A237-A235)*(A236-A235)+K235","v":110000},{"$f":"(M236-K236)/(M224-K224)*(L224-K224)+K236","v":93333.333333333343},{"$f":"(M237-M235)/(A237-A235)*(A236-A235)+M235","v":118333.33333333333},{"$f":"(O236-M236)/(O224-M224)*(N224-M224)+M236","v":195833.33333333334},{"$f":"(O237-O235)/(A237-A235)*(A236-A235)+O235","v":66666.666666666657},{"$f":"(Q236-O236)/(Q224-O224)*(P224-O224)+O236","v":-100000},{"$f":"(Q237-Q235)/(A237-A235)*(A236-A235)+Q235","v":233333.33333333331}]
[70,null,55000,{"$f":"(E237-C237)/(E224-C224)*(D224-C224)+C237","v":45000},70000,{"$f":"(G237-E237)/(G224-E224)*(F224-E224)+E237","v":50000},90000,{"$f":"(I237-G237)/(I224-G224)*(H224-G224)+G237","v":50000},110000,{"$f":"(K237-I237)/(K224-I224)*(J224-I224)+I237","v":5000},145000,{"$f":"(M237-K237)/(M224-K224)*(L224-K224)+K237","v":35000},200000,{"$f":"(O237-M237)/(O224-M224)*(N224-M224)+M237","v":50000},300000,{"$f":"(Q237-O237)/(Q224-O224)*(P224-O224)+O237","v":250000},350000,null,null,null,"Скорость"]
[]
[]
[]
["COL",null,3,4,5,6,7,8,9,10,11,12,13,14,15,16,17]
[]
[]
[null,"DP",10,{"$f":"IF(AND(V251>C244,V251<E244)=TRUE,V251,0)","v":0},25,{"$f":"IF(AND(V251>E244,V251<G244)=TRUE,V251,0)","v":0},50,{"$f":"IF(AND(V251>G244,V251<I244)=TRUE,V251,0)","v":0},75,{"$f":"IF(AND(V251>I244,V251<K244)=TRUE,V251,0)","v":0},100,{"$f":"IF(AND(V251>K244,V251<M244)=TRUE,V251,0)","v":0},150,{"$f":"IF(AND(V251>M244,V251<O244)=TRUE,V251,0)","v":0},250,{"$f":"IF(AND(V251>O244,V251<Q244)=TRUE,V251,0)","v":0},500]
["PM"]
[]
[0.5,null,8000,{"$f":"(E247-C247)/(E244-C244)*(D244-C244)+C247","v":5000},12500,{"$f":"(G247-E247)/(G244-E244)*(F244-E244)+E247","v":10000},15000,{"$f":"(I247-G247)/(I244-G244)*(H244-G244)+G247","v":14999.8},15000.1,{"$f":"(K247-I247)/(K244-I244)*(J244-I244)+I247","v":14999.8},15000.2,{"$f":"(M247-K247)/(M244-K244)*(L244-K244)+K247","v":15000.000000000004},15000.3,{"$f":"(O247-M247)/(O244-M244)*(N244-M244)+M247","v":15000.149999999998},15000.4,{"$f":"(Q247-O247)/(Q244-O244)*(P244-O244)+O247","v":15000.31},15000.49,null,"PM","Q","Qcal","DPcal","DP","TIPO"]
[{"$f":"IF(AND(S251>A247,S251<A249)=TRUE,S251,0)","v":0},null,{"$f":"(C249-C247)/(A249-A247)*(A248-A247)+C247","v":7000},{"$f":"(E248-C248)/(E244-C244)*(D244-C244)+C248","v":5000},{"$f":"(E249-E247)/(A249-A247)*(A248-A247)+E247","v":10000},{"$f":"(G248-E248)/(G244-E244)*(F244-E244)+E248","v":10000},{"$f":"(G249-G247)/(A249-A247)*(A248-A247)+G247","v":10000},{"$f":"(I248-G248)/(I244-G244)*(H244-G244)+G248","v":9999.7999999999956},{"$f":"(I249-I247)/(A249-A247)*(A248-A247)+I247","v":10000.100000000002},{"$f":"(K248-I248)/(K244-I244)*(J244-I244)+I248","v":9999.8000000000065},{"$f":"(K249-K247)/(A249-A247)*(A248-A247)+K247","v":10000.200000000001},{"$f":"(M248-K248)/(M244-K244)*(L244-K244)+K248","v":10000.000000000004},{"$f":"(M249-M247)/(A249-A247)*(A248-A247)+M247","v":10000.299999999999},{"$f":"(O248-M248)/(O244-M244)*(N244-M244)+M248","v":10000.150000000001},{"$f":"(O249-O247)/(A249-A247)*(A248-A247)+O247","v":10000.399999999998},{"$f":"(Q248-O248)/(Q244-O244)*(P244-O244)+O248","v":10000.309999999998},{"$f":"(Q249-Q247)/(A249-A247)*(A248-A247)+Q247","v":10000.489999999998}]
[1,null,9000,{"$f":"(E249-C249)/(E244-C244)*(D244-C244)+C249","v":5000},15000,{"$f":"(G249-E249)/(G244-E244)*(F244-E244)+E249","v":10000},20000,{"$f":"(I249-G249)/(I244-G244)*(H244-G244)+G249","v":19999.800000000003},20000.099999999999,{"$f":"(K249-I249)/(K244-I244)*(J244-I244)+I249","v":19999.799999999992},20000.2,{"$f":"(M249-K249)/(M244-K244)*(L244-K244)+K249","v":20000.000000000004},20000.3,{"$f":"(O249-M249)/(O244-M244)*(N244-M244)+M249","v":20000.149999999994},20000.400000000001,{"$f":"(Q249-O249)/(Q244-O244)*(P244-O244)+O249","v":20000.310000000001},20000.490000000002,null,null,"Stmc/h","Stmc/h","Mbar","Mbar"]
[{"$f":"IF(AND(S251>A249,S251<A251)=TRUE,S251,0)","v":0},null,{"$f":"(C251-C249)/(A251-A249)*(A250-A249)+C249","v":6000},{"$f":"(E250-C250)/(E244-C244)*(D244-C244)+C250","v":2000},{"$f":"(E251-E249)/(A251-A249)*(A250-A249)+E249","v":12000},{"$f":"(G250-E250)/(G244-E244)*(F244-E244)+E250","v":9000},{"$f":"(G251-G249)/(A251-A249)*(A250-A249)+G249","v":15000},{"$f":"(I250-G250)/(I244-G244)*(H244-G244)+G250","v":14999.800000000003},{"$f":"(I251-I249)/(A251-A249)*(A250-A249)+I249","v":15000.099999999999},{"$f":"(K250-I250)/(K244-I244)*(J244-I244)+I250","v":14999.799999999992},{"$f":"(K251-K249)/(A251-A249)*(A250-A249)+K249","v":15000.2},{"$f":"(M250-K250)/(M244-K244)*(L244-K244)+K250","v":15000.000000000004},{"$f":"(M251-M249)/(A251-A249)*(A250-A249)+M249","v":15000.3},{"$f":"(O250-M250)/(O244-M244)*(N244-M244)+M250","v":15000.149999999996},{"$f":"(O251-O249)/(A251-A249)*(A250-A249)+O249","v":15000.400000000001},{"$f":"(Q250-O250)/(Q244-O244)*(P244-O244)+O250","v":15000.310000000001},{"$f":"(Q251-Q249)/(A251-A249)*(A250-A249)+Q249","v":15000.490000000002}]
[2,null,12000,{"$f":"(E251-C251)/(E244-C244)*(D244-C244)+C251","v":8000},18000,{"$f":"(G251-E251)/(G244-E244)*(F244-E244)+E251","v":11000},25000,{"$f":"(I251-G251)/(I244-G244)*(H244-G244)+G251","v":24999.800000000003},25000.1,{"$f":"(K251-I251)/(K244-I244)*(J244-I244)+I251","v":24999.799999999992},25000.2,{"$f":"(M251-K251)/(M244-K244)*(L244-K244)+K251","v":25000.000000000004},25000.3,{"$f":"(O251-M251)/(O244-M244)*(N244-M244)+M251","v":25000.149999999994},25000.400000000001,{"$f":"(Q251-O251)/(Q244-O244)*(P244-O244)+O251","v":25000.31},25000.49,null,{"$f":"Лист1!B17*10","v":0.1},{"$f":"Лист1!B19","v":3500},{"$f":"VLOOKUP(S251,A244:Q265,HLOOKUP(V251,A244:Q265,22,0),0)","v":{"$error":"#N/A"}},{"$f":"Лист1!B18*10","v":100},{"$f":"IF(S251<A247,\"NO\",IF(S251>A261,\"NO\",IF(VLOOKUP(S251,A247:Q261,3,0)>T251,\"NO\",IF(VLOOKUP(S251,A247:Q261,17,0)<T251,\"NO\",IF(AND(U251>=T251-0.1,U251<T251+0.1)=TRUE,V251,\"NO\")))))","v":"NO"},"Фильтр газовый",{"$f":"Лист1!F19","v":"РЕД-С-5-2-350 DN350"}]
[{"$f":"IF(AND(S251>A251,S251<A253)=TRUE,S251,0)","v":0},null,{"$f":"(C253-C251)/(A253-A251)*(A252-A251)+C251","v":8666.6666666666661},{"$f":"(E252-C252)/(E244-C244)*(D244-C244)+C252","v":5999.9999999999982},{"$f":"(E253-E251)/(A253-A251)*(A252-A251)+E251","v":12666.666666666668},{"$f":"(G252-E252)/(G244-E244)*(F244-E244)+E252","v":7000.0000000000036},{"$f":"(G253-G251)/(A253-A251)*(A252-A251)+G251","v":18333.333333333332},{"$f":"(I252-G252)/(I244-G244)*(H244-G244)+G252","v":38333},{"$f":"(I253-I251)/(A253-A251)*(A252-A251)+I251","v":8333.4999999999964},{"$f":"(K252-I252)/(K244-I244)*(J244-I244)+I252","v":28332.999999999985},{"$f":"(K253-K251)/(A253-A251)*(A252-A251)+K251","v":1667},{"$f":"(M252-K252)/(M244-K244)*(L244-K244)+K252","v":1666.8000000000029},{"$f":"(M253-M251)/(A253-A251)*(A252-A251)+M251","v":1667.0999999999985},{"$f":"(O252-M252)/(O244-M244)*(N244-M244)+M252","v":1666.9499999999898},{"$f":"(O253-O251)/(A253-A251)*(A252-A251)+O251","v":1667.2000000000044},{"$f":"(Q252-O252)/(Q244-O244)*(P244-O244)+O252","v":1667.1166666666722},{"$f":"(Q253-Q251)/(A253-A251)*(A252-A251)+Q251","v":1667.2833333333365}]
[5,null,17000,{"$f":"(E253-C253)/(E244-C244)*(D244-C244)+C253","v":11000},26000,{"$f":"(G253-E253)/(G244-E244)*(F244-E244)+E253","v":17000},35000,{"$f":"(I253-G253)/(I244-G244)*(H244-G244)+G253","v":5000},50000,{"$f":"(K253-I253)/(K244-I244)*(J244-I244)+I253","v":20000},60000,{"$f":"(M253-K253)/(M244-K244)*(L244-K244)+K253","v":59999.8},60000.1,{"$f":"(O253-M253)/(O244-M244)*(N244-M244)+M253","v":59999.95},60000.2,{"$f":"(Q253-O253)/(Q244-O244)*(P244-O244)+O253","v":60000.099999999991},60000.3]
[{"$f":"IF(AND(S251>A253,S251<A255)=TRUE,S251,0)","v":0},null,{"$f":"(C255-C253)/(A255-A253)*(A254-A253)+C253","v":10000},{"$f":"(E254-C254)/(E244-C244)*(D244-C244)+C254","v":6000},{"$f":"(E255-E253)/(A255-A253)*(A254-A253)+E253","v":16000},{"$f":"(G254-E254)/(G244-E244)*(F244-E244)+E254","v":16000},{"$f":"(G255-G253)/(A255-A253)*(A254-A253)+G253","v":16000},{"$f":"(I254-G254)/(I244-G244)*(H244-G244)+G254","v":-24000},{"$f":"(I255-I253)/(A255-A253)*(A254-A253)+I253","v":36000},{"$f":"(K254-I254)/(K244-I244)*(J244-I244)+I254","v":-6000},{"$f":"(K255-K253)/(A255-A253)*(A254-A253)+K253","v":50000},{"$f":"(M254-K254)/(M244-K244)*(L244-K244)+K254","v":89999.6},{"$f":"(M255-M253)/(A255-A253)*(A254-A253)+M253","v":30000.199999999997},{"$f":"(O254-M254)/(O244-M244)*(N244-M244)+M254","v":59999.9},{"$f":"(O255-O253)/(A255-A253)*(A254-A253)+O253","v":10000.399999999994},{"$f":"(Q254-O254)/(Q244-O244)*(P244-O244)+O254","v":10000.299999999988},{"$f":"(Q255-Q253)/(A255-A253)*(A254-A253)+Q253","v":10000.5}]
[10,null,24000,{"$f":"(E255-C255)/(E244-C244)*(D244-C244)+C255","v":16000},36000,{"$f":"(G255-E255)/(G244-E244)*(F244-E244)+E255","v":18000},54000,{"$f":"(I255-G255)/(I244-G244)*(H244-G244)+G255","v":34000},64000,{"$f":"(K255-I255)/(K244-I244)*(J244-I244)+I255","v":46000},70000,{"$f":"(M255-K255)/(M244-K244)*(L244-K244)+K255","v":30000},90000,{"$f":"(O255-M255)/(O244-M244)*(N244-M244)+M255","v":60000},110000,{"$f":"(Q255-O255)/(Q244-O244)*(P244-O244)+O255","v":109999.9},110000.1]
[{"$f":"IF(AND(S251>A255,S251<A257)=TRUE,S251,0)","v":0},null,{"$f":"(C257-C255)/(A257-A255)*(A256-A255)+C255","v":16666.666666666664},{"$f":"(E256-C256)/(E244-C244)*(D244-C244)+C256","v":11777.777777777774},{"$f":"(E257-E255)/(A257-A255)*(A256-A255)+E255","v":24000},{"$f":"(G256-E256)/(G244-E244)*(F244-E244)+E256","v":11333.333333333328},{"$f":"(G257-G255)/(A257-A255)*(A256-A255)+G255","v":36666.666666666672},{"$f":"(I256-G256)/(I244-G244)*(H244-G244)+G256","v":105200.00000000001},2400,{"$f":"(K256-I256)/(K244-I244)*(J244-I244)+I256","v":-120400.00000000001},{"$f":"(K257-K255)/(A257-A255)*(A256-A255)+K255","v":43333.333333333336},{"$f":"(M256-K256)/(M244-K244)*(L244-K244)+K256","v":16666.666666666679},{"$f":"(M257-M255)/(A257-A255)*(A256-A255)+M255","v":56666.666666666664},{"$f":"(O256-M256)/(O244-M244)*(N244-M244)+M256","v":36666.666666666657},{"$f":"(O257-O255)/(A257-A255)*(A256-A255)+O255","v":70000},{"$f":"(Q256-O256)/(Q244-O244)*(P244-O244)+O256","v":116666.5},{"$f":"(Q257-Q255)/(A257-A255)*(A256-A255)+Q255","v":23333.5}]
[25,null,35000,{"$f":"(E257-C257)/(E244-C244)*(D244-C244)+C257","v":22333.333333333332},54000,{"$f":"(G257-E257)/(G244-E244)*(F244-E244)+E257","v":28000},80000,{"$f":"(I257-G257)/(I244-G244)*(H244-G244)+G257","v":40000},100000,{"$f":"(K257-I257)/(K244-I244)*(J244-I244)+I257","v":70000},110000,{"$f":"(M257-K257)/(M244-K244)*(L244-K244)+K257","v":50000},140000,{"$f":"(O257-M257)/(O244-M244)*(N244-M244)+M257","v":95000},170000,{"$f":"(Q257-O257)/(Q244-O244)*(P244-O244)+O257","v":100000},240000]
[{"$f":"IF(AND(S253>A257,S253<A259)=TRUE,S253,0)","v":0},null,{"$f":"(C259-C257)/(A259-A257)*(A258-A257)+C257","v":15000},{"$f":"(E258-C258)/(E244-C244)*(D244-C244)+C258","v":-4333.3333333333321},{"$f":"(E259-E257)/(A259-A257)*(A258-A257)+E257","v":44000},{"$f":"(G258-E258)/(G244-E244)*(F244-E244)+E258","v":-333.33333333332848},{"$f":"(G259-G257)/(A259-A257)*(A258-A257)+G257","v":88333.333333333328},{"$f":"(I258-G258)/(I244-G244)*(H244-G244)+G258","v":260200},2400,{"$f":"(K258-I258)/(K244-I244)*(J244-I244)+I258","v":-220400.00000000003},{"$f":"(K259-K257)/(A259-A257)*(A258-A257)+K257","v":76666.666666666672},{"$f":"(M258-K258)/(M244-K244)*(L244-K244)+K258","v":33333.333333333358},{"$f":"(M259-M257)/(A259-A257)*(A258-A257)+M257","v":98333.333333333328},{"$f":"(O258-M258)/(O244-M244)*(N244-M244)+M258","v":65833.333333333314},{"$f":"(O259-O257)/(A259-A257)*(A258-A257)+O257","v":120000},{"$f":"(Q258-O258)/(Q244-O244)*(P244-O244)+O258","v":100000},{"$f":"(Q259-Q257)/(A259-A257)*(A258-A257)+Q257","v":140000}]
[40,null,47000,{"$f":"(E259-C259)/(E244-C244)*(D244-C244)+C259","v":38333.333333333336},60000,{"$f":"(G259-E259)/(G244-E244)*(F244-E244)+E259","v":45000},75000,{"$f":"(I259-G259)/(I244-G244)*(H244-G244)+G259","v":25000},100000,{"$f":"(K259-I259)/(K244-I244)*(J244-I244)+I259","v":10000},130000,{"$f":"(M259-K259)/(M244-K244)*(L244-K244)+K259","v":60000},165000,{"$f":"(O259-M259)/(O244-M244)*(N244-M244)+M259","v":112500},200000,{"$f":"(Q259-O259)/(Q244-O244)*(P244-O244)+O259","v":100000},300000]
[{"$f":"IF(AND(S255>A259,S255<A261)=TRUE,S255,0)","v":0},null,{"$f":"(C261-C259)/(A261-A259)*(A260-A259)+C259","v":36333.333333333328},{"$f":"(E260-C260)/(E248-C248)*(D248-C248)+C260","v":29444.444444444434},{"$f":"(E261-E259)/(A261-A259)*(A260-A259)+E259","v":46666.666666666672},{"$f":"(G260-E260)/(G248-E248)*(F248-E248)+E260","v":{"$error":"#DIV/0!"}},{"$f":"(G261-G259)/(A261-A259)*(A260-A259)+G259","v":55000},{"$f":"(I260-G260)/(I248-G248)*(H248-G248)+G260","v":160200},2400,{"$f":"(K260-I260)/(K248-I248)*(J248-I248)+I260","v":-320400},{"$f":"(K261-K259)/(A261-A259)*(A260-A259)+K259","v":110000},{"$f":"(M260-K260)/(M248-K248)*(L248-K248)+K260","v":93333.333333333343},{"$f":"(M261-M259)/(A261-A259)*(A260-A259)+M259","v":118333.33333333333},{"$f":"(O260-M260)/(O248-M248)*(N248-M248)+M260","v":195833.33333333331},{"$f":"(O261-O259)/(A261-A259)*(A260-A259)+O259","v":66666.666666666657},{"$f":"(Q260-O260)/(Q248-O248)*(P248-O248)+O260","v":-100000},{"$f":"(Q261-Q259)/(A261-A259)*(A260-A259)+Q259","v":233333.33333333331}]
[70,null,55000,{"$f":"(E261-C261)/(E248-C248)*(D248-C248)+C261","v":45000},70000,{"$f":"(G261-E261)/(G248-E248)*(F248-E248)+E261","v":{"$error":"#DIV/0!"}},90000,{"$f":"(I261-G261)/(I248-G248)*(H248-G248)+G261","v":50000},110000,{"$f":"(K261-I261)/(K248-I248)*(J248-I248)+I261","v":5000},145000,{"$f":"(M261-K261)/(M248-K248)*(L248-K248)+K261","v":35000},200000,{"$f":"(O261-M261)/(O248-M248)*(N248-M248)+M261","v":50000},300000,{"$f":"(Q261-O261)/(Q248-O248)*(P248-O248)+O261","v":250000},350000,null,null,null,"Скорость"]
[]
[]
[]
["COL",null,3,4,5,6,7,8,9,10,11,12,13,14,15,16,17]
[]
[]
[null,"DP",10,{"$f":"IF(AND(V275>C268,V275<E268)=TRUE,V275,0)","v":0},25,{"$f":"IF(AND(V275>E268,V275<G268)=TRUE,V275,0)","v":0},50,{"$f":"IF(AND(V275>G268,V275<I268)=TRUE,V275,0)","v":0},75,{"$f":"IF(AND(V275>I268,V275<K268)=TRUE,V275,0)","v":0},100,{"$f":"IF(AND(V275>K268,V275<M268)=TRUE,V275,0)","v":0},150,{"$f":"IF(AND(V275>M268,V275<O268)=TRUE,V275,0)","v":0},250,{"$f":"IF(AND(V275>O268,V275<Q268)=TRUE,V275,0)","v":0},500]
["PM"]
[]
[0.5,null,12500,{"$f":"(E271-C271)/(E268-C268)*(D268-C268)+C271","v":7500},20000,{"$f":"(G271-E271)/(G268-E268)*(F268-E268)+E271","v":19999.95},20000.05,{"$f":"(I271-G271)/(I268-G268)*(H268-G268)+G271","v":19999.95},20000.099999999999,{"$f":"(K271-I271)/(K268-I268)*(J268-I268)+I271","v":19999.799999999992},20000.2,{"$f":"(M271-K271)/(M268-K268)*(L268-K268)+K271","v":20000.000000000004},20000.3,{"$f":"(O271-M271)/(O268-M268)*(N268-M268)+M271","v":20000.149999999994},20000.400000000001,{"$f":"(Q271-O271)/(Q268-O268)*(P268-O268)+O271","v":20000.310000000001},20000.490000000002,null,"PM","Q","Qcal","DPcal","DP","TIPO"]
[{"$f":"IF(AND(S275>A271,S275<A273)=TRUE,S275,0)","v":0},null,{"$f":"(C273-C271)/(A273-A271)*(A272-A271)+C271","v":10000},{"$f":"(E272-C272)/(E268-C268)*(D268-C268)+C272","v":6000},{"$f":"(E273-E271)/(A273-A271)*(A272-A271)+E271","v":16000},{"$f":"(G272-E272)/(G268-E268)*(F268-E268)+E272","v":17999.900000000001},{"$f":"(G273-G271)/(A273-A271)*(A272-A271)+G271","v":14000.099999999999},{"$f":"(I272-G272)/(I268-G268)*(H268-G268)+G272","v":14000.099999999999},{"$f":"(I273-I271)/(A273-A271)*(A272-A271)+I271","v":14000.099999999999},{"$f":"(K272-I272)/(K268-I268)*(J268-I268)+I272","v":13999.799999999992},{"$f":"(K273-K271)/(A273-A271)*(A272-A271)+K271","v":14000.2},{"$f":"(M272-K272)/(M268-K268)*(L268-K268)+K272","v":14000.000000000004},{"$f":"(M273-M271)/(A273-A271)*(A272-A271)+M271","v":14000.3},{"$f":"(O272-M272)/(O268-M268)*(N268-M268)+M272","v":14000.149999999996},{"$f":"(O273-O271)/(A273-A271)*(A272-A271)+O271","v":14000.400000000001},{"$f":"(Q272-O272)/(Q268-O268)*(P268-O268)+O272","v":14000.310000000001},{"$f":"(Q273-Q271)/(A273-A271)*(A272-A271)+Q271","v":14000.490000000002}]
[1,null,15000,{"$f":"(E273-C273)/(E268-C268)*(D268-C268)+C273","v":9000},24000,{"$f":"(G273-E273)/(G268-E268)*(F268-E268)+E273","v":22000},26000,{"$f":"(I273-G273)/(I268-G268)*(H268-G268)+G273","v":25999.800000000003},26000.1,{"$f":"(K273-I273)/(K268-I268)*(J268-I268)+I273","v":25999.799999999992},26000.2,{"$f":"(M273-K273)/(M268-K268)*(L268-K268)+K273","v":26000.000000000004},26000.3,{"$f":"(O273-M273)/(O268-M268)*(N268-M268)+M273","v":26000.149999999994},26000.400000000001,{"$f":"(Q273-O273)/(Q268-O268)*(P268-O268)+O273","v":26000.31},26000.49,null,null,"Stmc/h","Stmc/h","Mbar","Mbar"]
[{"$f":"IF(AND(S275>A273,S275<A275)=TRUE,S275,0)","v":0},null,{"$f":"(C275-C273)/(A275-A273)*(A274-A273)+C273","v":12000},{"$f":"(E274-C274)/(E268-C268)*(D268-C268)+C274","v":5333.3333333333339},{"$f":"(E275-E273)/(A275-A273)*(A274-A273)+E273","v":22000},{"$f":"(G274-E274)/(G268-E268)*(F268-E268)+E274","v":32000},{"$f":"(G275-G273)/(A275-A273)*(A274-A273)+G273","v":12000},{"$f":"(I274-G274)/(I268-G268)*(H268-G268)+G274","v":11999.800000000003},{"$f":"(I275-I273)/(A275-A273)*(A274-A273)+I273","v":12000.099999999999},{"$f":"(K274-I274)/(K268-I268)*(J268-I268)+I274","v":11999.799999999981},{"$f":"(K275-K273)/(A275-A273)*(A274-A273)+K273","v":12000.200000000004},{"$f":"(M274-K274)/(M268-K268)*(L268-K268)+K274","v":12000.000000000022},{"$f":"(M275-M273)/(A275-A273)*(A274-A273)+M273","v":12000.299999999996},{"$f":"(O274-M274)/(O268-M268)*(N268-M268)+M274","v":12000.149999999987},{"$f":"(O275-O273)/(A275-A273)*(A274-A273)+O273","v":12000.400000000001},{"$f":"(Q274-O274)/(Q268-O268)*(P268-O268)+O274","v":12000.309999999998},{"$f":"(Q275-Q273)/(A275-A273)*(A274-A273)+Q273","v":12000.490000000005}]
[2,null,18000,{"$f":"(E275-C275)/(E268-C268)*(D268-C268)+C275","v":12666.666666666666},26000,{"$f":"(G275-E275)/(G268-E268)*(F268-E268)+E275","v":12000},40000,{"$f":"(I275-G275)/(I268-G268)*(H268-G268)+G275","v":39999.800000000003},40000.1,{"$f":"(K275-I275)/(K268-I268)*(J268-I268)+I275","v":39999.800000000003},40000.199999999997,{"$f":"(M275-K275)/(M268-K268)*(L268-K268)+K275","v":39999.999999999985},40000.300000000003,{"$f":"(O275-M275)/(O268-M268)*(N268-M268)+M275","v":40000.150000000009},40000.400000000001,{"$f":"(Q275-O275)/(Q268-O268)*(P268-O268)+O275","v":40000.310000000005},40000.49,null,{"$f":"Лист1!B17*10","v":0.1},{"$f":"Лист1!B19","v":3500},{"$f":"VLOOKUP(S275,A268:Q289,HLOOKUP(V275,A268:Q289,22,0),0)","v":{"$error":"#N/A"}},{"$f":"Лист1!B18*10","v":100},{"$f":"IF(S275<A271,\"NO\",IF(S275>A285,\"NO\",IF(VLOOKUP(S275,A271:Q285,3,0)>T275,\"NO\",IF(VLOOKUP(S275,A271:Q285,17,0)<T275,\"NO\",IF(AND(U275>=T275-0.1,U275<T275+0.1)=TRUE,V275,\"NO\")))))","v":"NO"},"Фильтр газовый",{"$f":"Лист1!F20","v":"РЕД-С-6-2-400 DN400"}]
[{"$f":"IF(AND(S275>A275,S275<A277)=TRUE,S275,0)","v":0},null,{"$f":"(C277-C275)/(A277-A275)*(A276-A275)+C275","v":12000},{"$f":"(E276-C276)/(E268-C268)*(D268-C268)+C276","v":8888.8888888888905},{"$f":"(E277-E275)/(A277-A275)*(A276-A275)+E275","v":16666.666666666664},{"$f":"(G276-E276)/(G268-E268)*(F268-E268)+E276","v":6666.6666666666642},{"$f":"(G277-G275)/(A277-A275)*(A276-A275)+G275","v":26666.666666666664},{"$f":"(I276-G276)/(I268-G268)*(H268-G268)+G276","v":46666.333333333328},{"$f":"(I277-I275)/(A277-A275)*(A276-A275)+I275","v":16666.833333333332},{"$f":"(K276-I276)/(K268-I268)*(J268-I268)+I276","v":26666.333333333347},{"$f":"(K277-K275)/(A277-A275)*(A276-A275)+K275","v":13333.666666666661},{"$f":"(M276-K276)/(M268-K268)*(L268-K268)+K276","v":13333.466666666649},{"$f":"(M277-M275)/(A277-A275)*(A276-A275)+M275","v":13333.766666666666},{"$f":"(O276-M276)/(O268-M268)*(N268-M268)+M276","v":13333.616666666658},{"$f":"(O277-O275)/(A277-A275)*(A276-A275)+O275","v":13333.866666666672},{"$f":"(Q276-O276)/(Q268-O268)*(P268-O268)+O276","v":13333.783333333351},{"$f":"(Q277-Q275)/(A277-A275)*(A276-A275)+Q275","v":13333.949999999993}]
[5,null,27000,{"$f":"(E277-C277)/(E268-C268)*(D268-C268)+C277","v":18333.333333333336},40000,{"$f":"(G277-E277)/(G268-E268)*(F268-E268)+E277","v":20000},60000,{"$f":"(I277-G277)/(I268-G268)*(H268-G268)+G277","v":30000},75000,{"$f":"(K277-I277)/(K268-I268)*(J268-I268)+I277","v":60000},80000,{"$f":"(M277-K277)/(M268-K268)*(L268-K268)+K277","v":79999.799999999988},80000.100000000006,{"$f":"(O277-M277)/(O268-M268)*(N268-M268)+M277","v":79999.950000000012},80000.2,{"$f":"(Q277-O277)/(Q268-O268)*(P268-O268)+O277","v":80000.099999999991},80000.3]
[{"$f":"IF(AND(S275>A277,S275<A279)=TRUE,S275,0)","v":0},null,{"$f":"(C279-C277)/(A279-A277)*(A278-A277)+C277","v":16000},{"$f":"(E278-C278)/(E268-C268)*(D268-C268)+C278","v":10000},{"$f":"(E279-E277)/(A279-A277)*(A278-A277)+E277","v":25000},{"$f":"(G278-E278)/(G268-E268)*(F268-E268)+E278","v":14000},{"$f":"(G279-G277)/(A279-A277)*(A278-A277)+G277","v":36000},{"$f":"(I278-G278)/(I268-G268)*(H268-G268)+G278","v":8000},{"$f":"(I279-I277)/(A279-A277)*(A278-A277)+I277","v":50000},{"$f":"(K278-I278)/(K268-I268)*(J268-I268)+I278","v":65000},{"$f":"(K279-K277)/(A279-A277)*(A278-A277)+K277","v":45000},{"$f":"(M278-K278)/(M268-K268)*(L268-K268)+K278","v":94999.599999999977},{"$f":"(M279-M277)/(A279-A277)*(A278-A277)+M277","v":20000.200000000012},{"$f":"(O278-M278)/(O268-M268)*(N268-M268)+M278","v":20000.050000000047},{"$f":"(O279-O277)/(A279-A277)*(A278-A277)+O277","v":20000.299999999988},{"$f":"(Q278-O278)/(Q268-O268)*(P268-O268)+O278","v":20000.199999999983},{"$f":"(Q279-Q277)/(A279-A277)*(A278-A277)+Q277","v":20000.399999999994}]
[10,null,38000,{"$f":"(E279-C279)/(E268-C268)*(D268-C268)+C279","v":26666.666666666668},55000,{"$f":"(G279-E279)/(G268-E268)*(F268-E268)+E279","v":26000},84000,{"$f":"(I279-G279)/(I268-G268)*(H268-G268)+G279","v":52000},100000,{"$f":"(K279-I279)/(K268-I268)*(J268-I268)+I279","v":55000},115000,{"$f":"(M279-K279)/(M268-K268)*(L268-K268)+K279","v":65000},140000,{"$f":"(O279-M279)/(O268-M268)*(N268-M268)+M279","v":139999.84999999998},140000.1,{"$f":"(Q279-O279)/(Q268-O268)*(P268-O268)+O279","v":140000},140000.20000000001]
[{"$f":"IF(AND(S275>A279,S275<A281)=TRUE,S275,0)","v":0},null,{"$f":"(C281-C279)/(A281-A279)*(A280-A279)+C279","v":26000},{"$f":"(E280-C280)/(E268-C268)*(D268-C268)+C280","v":19555.555555555551},{"$f":"(E281-E279)/(A281-A279)*(A280-A279)+E279","v":35666.666666666672},{"$f":"(G280-E280)/(G268-E268)*(F268-E268)+E280","v":18000.000000000007},{"$f":"(G281-G279)/(A281-A279)*(A280-A279)+G279","v":53333.333333333336},{"$f":"(I280-G280)/(I268-G268)*(H268-G268)+G280","v":155200},2400,{"$f":"(K280-I280)/(K268-I268)*(J268-I268)+I280","v":-205400.00000000003},{"$f":"(K281-K279)/(A281-A279)*(A280-A279)+K279","v":71666.666666666672},{"$f":"(M280-K280)/(M268-K268)*(L268-K268)+K280","v":41666.666666666672},{"$f":"(M281-M279)/(A281-A279)*(A280-A279)+M279","v":86666.666666666672},{"$f":"(O280-M280)/(O268-M268)*(N268-M268)+M280","v":126666.41666666667},{"$f":"(O281-O279)/(A281-A279)*(A280-A279)+O279","v":60000.166666666672},{"$f":"(Q280-O280)/(Q268-O268)*(P268-O268)+O280","v":120000},{"$f":"(Q281-Q279)/(A281-A279)*(A280-A279)+Q279","v":0.33333333334303461}]
[25,null,56000,{"$f":"(E281-C281)/(E268-C268)*(D268-C268)+C281","v":37333.333333333328},84000,{"$f":"(G281-E281)/(G268-E268)*(F268-E268)+E281","v":38000},130000,{"$f":"(I281-G281)/(I268-G268)*(H268-G268)+G281","v":70000},160000,{"$f":"(K281-I281)/(K268-I268)*(J268-I268)+I281","v":100000},180000,{"$f":"(M281-K281)/(M268-K268)*(L268-K268)+K281","v":100000},220000,{"$f":"(O281-M281)/(O268-M268)*(N268-M268)+M281","v":160000},260000,{"$f":"(Q281-O281)/(Q268-O268)*(P268-O268)+O281","v":170000},350000]
[{"$f":"IF(AND(S277>A281,S277<A283)=TRUE,S277,0)","v":0},null,{"$f":"(C283-C281)/(A283-A281)*(A282-A281)+C281","v":32666.666666666664},{"$f":"(E282-C282)/(E268-C268)*(D268-C268)+C282","v":5111.1111111111095},{"$f":"(E283-E281)/(A283-A281)*(A282-A281)+E281","v":74000},{"$f":"(G282-E282)/(G268-E268)*(F268-E268)+E282","v":1333.333333333343},{"$f":"(G283-G281)/(A283-A281)*(A282-A281)+G281","v":146666.66666666666},{"$f":"(I282-G282)/(I268-G268)*(H268-G268)+G282","v":435200},2400,{"$f":"(K282-I282)/(K268-I268)*(J268-I268)+I282","v":-380400},{"$f":"(K283-K281)/(A283-A281)*(A282-A281)+K281","v":130000},{"$f":"(M282-K282)/(M268-K268)*(L268-K268)+K282","v":83333.333333333314},{"$f":"(M283-M281)/(A283-A281)*(A282-A281)+M281","v":153333.33333333334},{"$f":"(O282-M282)/(O268-M268)*(N268-M268)+M282","v":218333.33333333337},{"$f":"(O283-O281)/(A283-A281)*(A282-A281)+O281","v":110000},{"$f":"(Q282-O282)/(Q268-O268)*(P268-O268)+O282","v":120000},{"$f":"(Q283-Q281)/(A283-A281)*(A282-A281)+Q281","v":100000}]
[40,null,70000,{"$f":"(E283-C283)/(E268-C268)*(D268-C268)+C283","v":56666.666666666672},90000,{"$f":"(G283-E283)/(G268-E268)*(F268-E268)+E283","v":60000},120000,{"$f":"(I283-G283)/(I268-G268)*(H268-G268)+G283","v":40000},160000,{"$f":"(K283-I283)/(K268-I268)*(J268-I268)+I283","v":10000},210000,{"$f":"(M283-K283)/(M268-K268)*(L268-K268)+K283","v":110000},260000,{"$f":"(O283-M283)/(O268-M268)*(N268-M268)+M283","v":125000},350000,{"$f":"(Q283-O283)/(Q268-O268)*(P268-O268)+O283","v":200000},500000]
[{"$f":"IF(AND(S279>A283,S279<A285)=TRUE,S279,0)","v":0},null,{"$f":"(C285-C283)/(A285-A283)*(A284-A283)+C283","v":43333.333333333336},{"$f":"(E284-C284)/(E272-C272)*(D272-C272)+C284","v":38888.888888888891},{"$f":"(E285-E283)/(A285-A283)*(A284-A283)+E283","v":50000},{"$f":"(G284-E284)/(G272-E272)*(F272-E272)+E284","v":33333.333333333328},{"$f":"(G285-G283)/(A285-A283)*(A284-A283)+G283","v":66666.666666666672},{"$f":"(I284-G284)/(I272-G272)*(H272-G272)+G284","v":{"$error":"#DIV/0!"}},2400,{"$f":"(K284-I284)/(K272-I272)*(J272-I272)+I284","v":-420400},{"$f":"(K285-K283)/(A285-A283)*(A284-A283)+K283","v":143333.33333333331},{"$f":"(M284-K284)/(M272-K272)*(L272-K272)+K284","v":149999.99999999994},{"$f":"(M285-M283)/(A285-A283)*(A284-A283)+M283","v":140000},{"$f":"(O284-M284)/(O272-M272)*(N272-M272)+M284","v":125000},{"$f":"(O285-O283)/(A285-A283)*(A284-A283)+O283","v":150000},{"$f":"(Q284-O284)/(Q272-O272)*(P272-O272)+O284","v":0},{"$f":"(Q285-Q283)/(A285-A283)*(A284-A283)+Q283","v":300000}]
[70,null,90000,{"$f":"(E285-C285)/(E272-C272)*(D272-C272)+C285","v":70000},120000,{"$f":"(G285-E285)/(G272-E272)*(F272-E272)+E285","v":80000},160000,{"$f":"(I285-G285)/(I272-G272)*(H272-G272)+G285","v":{"$error":"#DIV/0!"}},210000,{"$f":"(K285-I285)/(K272-I272)*(J272-I272)+I285","v":60000},260000,{"$f":"(M285-K285)/(M272-K272)*(L272-K272)+K285","v":80000},350000,{"$f":"(O285-M285)/(O272-M272)*(N272-M272)+M285","v":125000},500000,{"$f":"(Q285-O285)/(Q272-O272)*(P272-O272)+O285","v":350000},650000,null,null,null,"Скорость"]
[]
[]
[]
["COL",null,3,4,5,6,7,8,9,10,11,12,13,14,15,16,17]
[]
[]
[null,"DP",10,{"$f":"IF(AND(V299>C292,V299<E292)=TRUE,V299,0)","v":0},25,{"$f":"IF(AND(V299>E292,V299<G292)=TRUE,V299,0)","v":0},50,{"$f":"IF(AND(V299>G292,V299<I292)=TRUE,V299,0)","v":0},75,{"$f":"IF(AND(V299>I292,V299<K292)=TRUE,V299,0)","v":0},100,{"$f":"IF(AND(V299>K292,V299<M292)=TRUE,V299,0)","v":0},150,{"$f":"IF(AND(V299>M292,V299<O292)=TRUE,V299,0)","v":0},250,{"$f":"IF(AND(V299>O292,V299<Q292)=TRUE,V299,0)","v":0},500]
["PM"]
[]
[0.5,null,{"$f":"C271*1.4","v":17500},{"$f":"(E295-C295)/(E292-C292)*(D292-C292)+C295","v":9166.6666666666661},{"$f":"E271*1.5","v":30000},{"$f":"(G295-E295)/(G292-E292)*(F292-E292)+E295","v":28999.922500000001},{"$f":"G271*1.55","v":31000.077499999999},{"$f":"(I295-G295)/(I292-G292)*(H292-G292)+G295","v":30999.922500000001},{"$f":"I271*1.55","v":31000.154999999999},{"$f":"(K295-I295)/(K292-I292)*(J292-I292)+I295","v":30999.689999999991},{"$f":"K271*1.55","v":31000.31},{"$f":"(M295-K295)/(M292-K292)*(L292-K292)+K295","v":31000.000000000004},{"$f":"M271*1.55","v":31000.465},{"$f":"(O295-M295)/(O292-M292)*(N292-M292)+M295","v":31000.465},{"$f":"M295","v":31000.465},{"$f":"(Q295-O295)/(Q292-O292)*(P292-O292)+O295","v":31000.465},{"$f":"M295","v":31000.465},null,"PM","Q","Qcal","DPcal","DP","TIPO"]
[{"$f":"IF(AND(S299>A295,S299<A297)=TRUE,S299,0)","v":0},null,{"$f":"(C297-C295)/(A297-A295)*(A296-A295)+C295","v":14000},{"$f":"(E296-C296)/(E292-C292)*(D292-C292)+C296","v":7333.3333333333339},{"$f":"(E297-E295)/(A297-A295)*(A296-A295)+E295","v":24000},{"$f":"(G296-E296)/(G292-E292)*(F292-E292)+E296","v":26299.845000000001},{"$f":"(G297-G295)/(A297-A295)*(A296-A295)+G295","v":21700.154999999999},{"$f":"(I296-G296)/(I292-G292)*(H292-G292)+G296","v":21700.154999999999},{"$f":"(I297-I295)/(A297-A295)*(A296-A295)+I295","v":21700.154999999999},{"$f":"(K296-I296)/(K292-I292)*(J292-I292)+I296","v":21699.690000000002},{"$f":"(K297-K295)/(A297-A295)*(A296-A295)+K295","v":21700.309999999998},{"$f":"(M296-K296)/(M292-K292)*(L292-K292)+K296","v":21699.999999999985},{"$f":"(M297-M295)/(A297-A295)*(A296-A295)+M295","v":21700.465000000004},{"$f":"(O296-M296)/(O292-M292)*(N292-M292)+M296","v":21700.232500000016},{"$f":"(O297-O295)/(A297-A295)*(A296-A295)+O295","v":21700.619999999995},{"$f":"(Q296-O296)/(Q292-O292)*(P292-O292)+O296","v":21700.774999999987},{"$f":"(Q297-Q295)/(A297-A295)*(A296-A295)+Q295","v":21700.465000000004}]
[1,null,{"$f":"C273*1.4","v":21000},{"$f":"(E297-C297)/(E292-C292)*(D292-C292)+C297","v":11000},{"$f":"E273*1.5","v":36000},{"$f":"(G297-E297)/(G292-E292)*(F292-E292)+E297","v":31700},{"$f":"G273*1.55","v":40300},{"$f":"(I297-G297)/(I292-G292)*(H292-G292)+G297","v":40299.69},{"$f":"I273*1.55","v":40300.154999999999},{"$f":"(K297-I297)/(K292-I292)*(J292-I292)+I297","v":40299.689999999981},{"$f":"K273*1.55","v":40300.310000000005},{"$f":"(M297-K297)/(M292-K292)*(L292-K292)+K297","v":40300.000000000022},{"$f":"M273*1.55","v":40300.464999999997},{"$f":"(O297-M297)/(O292-M292)*(N292-M292)+M297","v":40300.69749999998},{"$f":"K297","v":40300.310000000005},{"$f":"(Q297-O297)/(Q292-O292)*(P292-O292)+O297","v":40300.155000000013},{"$f":"M297","v":40300.464999999997},null,null,"Stmc/h","Stmc/h","Mbar","Mbar"]
[{"$f":"IF(AND(S299>A297,S299<A299)=TRUE,S299,0)","v":0},null,{"$f":"(C299-C297)/(A299-A297)*(A298-A297)+C297","v":16800},{"$f":"(E298-C298)/(E292-C292)*(D292-C292)+C298","v":6000},{"$f":"(E299-E297)/(A299-A297)*(A298-A297)+E297","v":33000},{"$f":"(G298-E298)/(G292-E292)*(F292-E292)+E298","v":47400},{"$f":"(G299-G297)/(A299-A297)*(A298-A297)+G297","v":18600},{"$f":"(I298-G298)/(I292-G292)*(H292-G292)+G298","v":18599.690000000002},{"$f":"(I299-I297)/(A299-A297)*(A298-A297)+I297","v":18600.154999999999},{"$f":"(K298-I298)/(K292-I292)*(J292-I292)+I298","v":18599.689999999959},{"$f":"(K299-K297)/(A299-A297)*(A298-A297)+K297","v":18600.310000000012},{"$f":"(M298-K298)/(M292-K292)*(L292-K292)+K298","v":18600.000000000058},{"$f":"(M299-M297)/(A299-A297)*(A298-A297)+M297","v":18600.464999999989},{"$f":"(O298-M298)/(O292-M292)*(N292-M292)+M298","v":18600.697499999955},{"$f":"(O299-O297)/(A299-A297)*(A298-A297)+O297","v":18600.310000000012},{"$f":"(Q298-O298)/(Q292-O292)*(P292-O292)+O298","v":18600.155000000035},{"$f":"(Q299-Q297)/(A299-A297)*(A298-A297)+Q297","v":18600.464999999989}]
[2,null,{"$f":"C275*1.4","v":25200},{"$f":"(E299-C299)/(E292-C292)*(D292-C292)+C299","v":16000},{"$f":"E275*1.5","v":39000},{"$f":"(G299-E299)/(G292-E292)*(F292-E292)+E299","v":16000},{"$f":"G275*1.55","v":62000},{"$f":"(I299-G299)/(I292-G292)*(H292-G292)+G299","v":61999.69},{"$f":"I275*1.55","v":62000.154999999999},{"$f":"(K299-I299)/(K292-I292)*(J292-I292)+I299","v":61999.69},{"$f":"K275*1.55","v":62000.31},{"$f":"(M299-K299)/(M292-K292)*(L292-K292)+K299","v":61999.999999999985},{"$f":"M275*1.55","v":62000.465000000004},{"$f":"(O299-M299)/(O292-M292)*(N292-M292)+M299","v":62000.697500000009},{"$f":"K299","v":62000.31},{"$f":"(Q299-O299)/(Q292-O292)*(P292-O292)+O299","v":62000.154999999992},{"$f":"M299","v":62000.465000000004},null,{"$f":"Лист1!B17*10","v":0.1},{"$f":"Лист1!B19","v":3500},{"$f":"VLOOKUP(S299,A292:Q313,HLOOKUP(V299,A292:Q313,22,0),0)","v":{"$error":"#N/A"}},{"$f":"Лист1!B18*10","v":100},{"$f":"IF(S299<A295,\"NO\",IF(S299>A309,\"NO\",IF(VLOOKUP(S299,A295:Q309,3,0)>T299,\"NO\",IF(VLOOKUP(S299,A295:Q309,17,0)<T299,\"NO\",IF(AND(U299>=T299-0.1,U299<T299+0.1)=TRUE,V299,\"NO\")))))","v":"NO"},"Фильтр газовый",{"$f":"Лист1!F21","v":"РЕД-С-8-2-500 DN500"}]
[{"$f":"IF(AND(S299>A299,S299<A301)=TRUE,S299,0)","v":0},null,{"$f":"(C301-C299)/(A301-A299)*(A300-A299)+C299","v":16800},{"$f":"(E300-C300)/(E292-C292)*(D292-C292)+C300","v":11333.333333333334},{"$f":"(E301-E299)/(A301-A299)*(A300-A299)+E299","v":25000},{"$f":"(G300-E300)/(G292-E292)*(F292-E292)+E300","v":8666.6666666666715},{"$f":"(G301-G299)/(A301-A299)*(A300-A299)+G299","v":41333.333333333328},{"$f":"(I300-G300)/(I292-G292)*(H292-G292)+G300","v":72332.816666666651},{"$f":"(I301-I299)/(A301-A299)*(A300-A299)+I299","v":25833.591666666667},{"$f":"(K300-I300)/(K292-I292)*(J292-I292)+I300","v":41332.816666666688},{"$f":"(K301-K299)/(A301-A299)*(A300-A299)+K299","v":20667.183333333327},{"$f":"(M300-K300)/(M292-K292)*(L292-K292)+K300","v":20666.873333333315},{"$f":"(M301-M299)/(A301-A299)*(A300-A299)+M299","v":20667.338333333333},{"$f":"(O300-M300)/(O292-M292)*(N292-M292)+M300","v":20667.88083333334},{"$f":"(O301-O299)/(A301-A299)*(A300-A299)+O299","v":20666.976666666662},{"$f":"(Q300-O300)/(Q292-O292)*(P292-O292)+O300","v":20666.821666666656},{"$f":"(Q301-Q299)/(A301-A299)*(A300-A299)+Q299","v":20667.131666666668}]
[5,null,{"$f":"C277*1.4","v":37800},{"$f":"(E301-C301)/(E292-C292)*(D292-C292)+C301","v":23000},{"$f":"E277*1.5","v":60000},{"$f":"(G301-E301)/(G292-E292)*(F292-E292)+E301","v":27000},{"$f":"G277*1.55","v":93000},{"$f":"(I301-G301)/(I292-G292)*(H292-G292)+G301","v":46500},{"$f":"I277*1.55","v":116250},{"$f":"(K301-I301)/(K292-I292)*(J292-I292)+I301","v":93000},{"$f":"K277*1.55","v":124000},{"$f":"(M301-K301)/(M292-K292)*(L292-K292)+K301","v":123999.68999999997},{"$f":"M277*1.55","v":124000.15500000001},{"$f":"(O301-M301)/(O292-M292)*(N292-M292)+M301","v":123999.92250000004},{"$f":"O277*1.55","v":124000.31},{"$f":"(Q301-O301)/(Q292-O292)*(P292-O292)+O301","v":124000.15499999998},{"$f":"Q277*1.55","v":124000.46500000001}]
[{"$f":"IF(AND(S299>A301,S299<A303)=TRUE,S299,0)","v":0},null,{"$f":"(C303-C301)/(A303-A301)*(A302-A301)+C301","v":22400},{"$f":"(E302-C302)/(E292-C292)*(D292-C292)+C302","v":12333.333333333334},{"$f":"(E303-E301)/(A303-A301)*(A302-A301)+E301","v":37500},{"$f":"(G302-E302)/(G292-E292)*(F292-E292)+E302","v":19200},{"$f":"(G303-G301)/(A303-A301)*(A302-A301)+G301","v":55800},{"$f":"(I302-G302)/(I292-G292)*(H292-G292)+G302","v":12400},{"$f":"(I303-I301)/(A303-A301)*(A302-A301)+I301","v":77500},{"$f":"(K302-I302)/(K292-I292)*(J292-I292)+I302","v":100750},{"$f":"(K303-K301)/(A303-A301)*(A302-A301)+K301","v":69750},{"$f":"(M302-K302)/(M292-K292)*(L292-K292)+K302","v":147249.37999999995},{"$f":"(M303-M301)/(A303-A301)*(A302-A301)+M301","v":31000.310000000027},{"$f":"(O302-M302)/(O292-M292)*(N292-M292)+M302","v":31000.077500000116},{"$f":"(O303-O301)/(A303-A301)*(A302-A301)+O301","v":31000.464999999967},{"$f":"(Q302-O302)/(Q292-O292)*(P292-O292)+O302","v":31000.309999999954},{"$f":"(Q303-Q301)/(A303-A301)*(A302-A301)+Q301","v":31000.619999999981}]
[10,null,{"$f":"C279*1.4","v":53200},{"$f":"(E303-C303)/(E292-C292)*(D292-C292)+C303","v":33666.666666666672},{"$f":"E279*1.5","v":82500},{"$f":"(G303-E303)/(G292-E292)*(F292-E292)+E303","v":34800},{"$f":"G279*1.55","v":130200},{"$f":"(I303-G303)/(I292-G292)*(H292-G292)+G303","v":80600},{"$f":"I279*1.55","v":155000},{"$f":"(K303-I303)/(K292-I292)*(J292-I292)+I303","v":85250},{"$f":"K279*1.55","v":178250},{"$f":"(M303-K303)/(M292-K292)*(L292-K292)+K303","v":100750},{"$f":"M279*1.55","v":217000},{"$f":"(O303-M303)/(O292-M292)*(N292-M292)+M303","v":216999.76749999996},{"$f":"O279*1.55","v":217000.15500000003},{"$f":"(Q303-O303)/(Q292-O292)*(P292-O292)+O303","v":217000.00000000003},{"$f":"Q279*1.55","v":217000.31000000003}]
[{"$f":"IF(AND(S299>A303,S299<A305)=TRUE,S299,0)","v":0},null,{"$f":"(C305-C303)/(A305-A303)*(A304-A303)+C303","v":36400},{"$f":"(E304-C304)/(E292-C292)*(D292-C292)+C304","v":25000},{"$f":"(E305-E303)/(A305-A303)*(A304-A303)+E303","v":53500},{"$f":"(G304-E304)/(G292-E292)*(F292-E292)+E304","v":24333.333333333325},{"$f":"(G305-G303)/(A305-A303)*(A304-A303)+G303","v":82666.666666666672},{"$f":"(I304-G304)/(I292-G292)*(H292-G292)+G304","v":62000.000000000015},{"$f":"(I305-I303)/(A305-A303)*(A304-A303)+I303","v":93000},{"$f":"(K304-I304)/(K292-I292)*(J292-I292)+I304","v":38750.000000000015},{"$f":"(K305-K303)/(A305-A303)*(A304-A303)+K303","v":111083.33333333333},{"$f":"(M304-K304)/(M292-K292)*(L292-K292)+K304","v":64583.333333333299},{"$f":"(M305-M303)/(A305-A303)*(A304-A303)+M303","v":134333.33333333334},{"$f":"(O304-M304)/(O292-M292)*(N292-M292)+M304","v":196332.94583333327},{"$f":"(O305-O303)/(A305-A303)*(A304-A303)+O303","v":93000.25833333339},{"$f":"(Q304-O304)/(Q292-O292)*(P292-O292)+O304","v":186000.00000000003},{"$f":"(Q305-Q303)/(A305-A303)*(A304-A303)+Q303","v":0.51666666675009765}]
[25,null,{"$f":"C281*1.4","v":78400},{"$f":"(E305-C305)/(E292-C292)*(D292-C292)+C305","v":46666.666666666664},{"$f":"E281*1.5","v":126000},{"$f":"(G305-E305)/(G292-E292)*(F292-E292)+E305","v":50500},{"$f":"G281*1.55","v":201500},{"$f":"(I305-G305)/(I292-G292)*(H292-G292)+G305","v":108500},{"$f":"I281*1.55","v":248000},{"$f":"(K305-I305)/(K292-I292)*(J292-I292)+I305","v":155000},{"$f":"K281*1.55","v":279000},{"$f":"(M305-K305)/(M292-K292)*(L292-K292)+K305","v":155000},{"$f":"M281*1.55","v":341000},{"$f":"(O305-M305)/(O292-M292)*(N292-M292)+M305","v":248000},{"$f":"O281*1.55","v":403000},{"$f":"(Q305-O305)/(Q292-O292)*(P292-O292)+O305","v":263500},{"$f":"Q281*1.55","v":542500}]
[{"$f":"IF(AND(S301>A305,S301<A307)=TRUE,S301,0)","v":0},null,{"$f":"(C307-C305)/(A307-A305)*(A306-A305)+C305","v":92400},{"$f":"(E306-C306)/(E292-C292)*(D292-C292)+C306","v":30000},{"$f":"(E307-E305)/(A307-A305)*(A306-A305)+E305","v":186000},{"$f":"(G306-E306)/(G292-E292)*(F292-E292)+E306","v":34666.666666666686},{"$f":"(G307-G305)/(A307-A305)*(A306-A305)+G305","v":337333.33333333331},{"$f":"(I306-G306)/(I292-G292)*(H292-G292)+G306","v":1007200},2400,{"$f":"(K306-I306)/(K292-I292)*(J292-I292)+I306","v":-1172400},{"$f":"(K307-K305)/(A307-A305)*(A306-A305)+K305","v":394000},{"$f":"(M306-K306)/(M292-K292)*(L292-K292)+K306","v":230000},{"$f":"(M307-M305)/(A307-A305)*(A306-A305)+M305","v":476000},{"$f":"(O306-M306)/(O292-M292)*(N292-M292)+M306","v":452999.99999999994},{"$f":"(O307-O305)/(A307-A305)*(A306-A305)+O305","v":491333.33333333337},{"$f":"(Q306-O306)/(Q292-O292)*(P292-O292)+O306","v":369333.33333333337},{"$f":"(Q307-Q305)/(A307-A305)*(A306-A305)+Q305","v":613333.33333333337}]
[40,null,70000,{"$f":"(E307-C307)/(E292-C292)*(D292-C292)+C307","v":56666.666666666672},90000,{"$f":"(G307-E307)/(G292-E292)*(F292-E292)+E307","v":60000},120000,{"$f":"(I307-G307)/(I292-G292)*(H292-G292)+G307","v":40000},160000,{"$f":"(K307-I307)/(K292-I292)*(J292-I292)+I307","v":10000},210000,{"$f":"(M307-K307)/(M292-K292)*(L292-K292)+K307","v":110000},260000,{"$f":"(O307-M307)/(O292-M292)*(N292-M292)+M307","v":125000},350000,{"$f":"(Q307-O307)/(Q292-O292)*(P292-O292)+O307","v":200000},500000]
[{"$f":"IF(AND(S303>A307,S303<A309)=TRUE,S303,0)","v":0},null,{"$f":"(C309-C307)/(A309-A307)*(A308-A307)+C307","v":43333.333333333336},{"$f":"(E308-C308)/(E296-C296)*(D296-C296)+C308","v":38888.888888888891},{"$f":"(E309-E307)/(A309-A307)*(A308-A307)+E307","v":50000},{"$f":"(G308-E308)/(G296-E296)*(F296-E296)+E308","v":33333.333333333328},{"$f":"(G309-G307)/(A309-A307)*(A308-A307)+G307","v":66666.666666666672},{"$f":"(I308-G308)/(I296-G296)*(H296-G296)+G308","v":{"$error":"#DIV/0!"}},2400,{"$f":"(K308-I308)/(K296-I296)*(J296-I296)+I308","v":-420399.99999999994},{"$f":"(K309-K307)/(A309-A307)*(A308-A307)+K307","v":143333.33333333331},{"$f":"(M308-K308)/(M296-K296)*(L296-K296)+K308","v":149999.99999999994},{"$f":"(M309-M307)/(A309-A307)*(A308-A307)+M307","v":140000},{"$f":"(O308-M308)/(O296-M296)*(N296-M296)+M308","v":125000},{"$f":"(O309-O307)/(A309-A307)*(A308-A307)+O307","v":150000},{"$f":"(Q308-O308)/(Q296-O296)*(P296-O296)+O308","v":0},{"$f":"(Q309-Q307)/(A309-A307)*(A308-A307)+Q307","v":300000}]
[70,null,90000,{"$f":"(E309-C309)/(E296-C296)*(D296-C296)+C309","v":70000},120000,{"$f":"(G309-E309)/(G296-E296)*(F296-E296)+E309","v":80000},160000,{"$f":"(I309-G309)/(I296-G296)*(H296-G296)+G309","v":{"$error":"#DIV/0!"}},210000,{"$f":"(K309-I309)/(K296-I296)*(J296-I296)+I309","v":60000},260000,{"$f":"(M309-K309)/(M296-K296)*(L296-K296)+K309","v":80000},350000,{"$f":"(O309-M309)/(O296-M296)*(N296-M296)+M309","v":125000},500000,{"$f":"(Q309-O309)/(Q296-O296)*(P296-O296)+O309","v":350000},650000,null,null,null,"Скорость"]
[]
[]
[]
["COL",null,3,4,5,6,7,8,9,10,11,12,13,14,15,16,17]

{"sheet":"MODULO1","index":4,"n_rows":0,"n_cols":0,"rows_kept":0,"cut":false,"hidden":true,"merged":[]}

{"sheet":"Modulo5","index":5,"n_rows":0,"n_cols":0,"rows_kept":0,"cut":false,"hidden":true,"merged":[]}

{"sheet":"Modulo4","index":6,"n_rows":0,"n_cols":0,"rows_kept":0,"cut":false,"hidden":true,"merged":[]}

{"sheet":"Modulo6","index":7,"n_rows":0,"n_cols":0,"rows_kept":0,"cut":false,"hidden":true,"merged":[]}

{"sheet":"Modulo2","index":8,"n_rows":0,"n_cols":0,"rows_kept":0,"cut":false,"hidden":true,"merged":[]}

{"sheet":"Modulo3","index":9,"n_rows":0,"n_cols":0,"rows_kept":0,"cut":false,"hidden":true,"merged":[]}